{"text_format":"1","workbook":"xlsx","n_sheets":3,"sheets":["invoerblad","Skylux EP","taal"],"not_rendered":{"charts":0,"images":125,"macros":1,"external_links":0,"defined_names":18,"comments":1,"pivot_tables":0},"unopened":[],"bounds":{"document_bytes":16777216,"sheet_cells":100000,"rows_first":2000,"rows_last":500,"rows_between":2000,"halvings":0,"cell_chars":16384,"cell_head_chars":4096},"cells_cut":0,"cells_raw":0,"read":"whole","date_system":"1900"}

{"sheet":"invoerblad","index":0,"n_rows":150,"n_cols":10,"rows_kept":150,"cut":false,"hidden":false,"merged":[[18,4,18,5],[20,4,20,5]]}
[{"$f":"\"        \"&taal!A65","v":"        U-waarde bepaling van Skylux lichtkoepels volgens norm EN 1873:2014+A1:2016"},null,null,null,null,null,"v.9-2024",{"$f":"NOW()","v":"2024-09-04T14:31:42.390"},null,false]
[null,null,{"$f":"taal!A2&\" :\"","v":"taal :"},null,null,null,null,null,null,1]
[null,null,{"$f":"taal!A67&\" :\"","v":"type :"},null,null,null,null,null,null,1]
[null,null,{"$f":"taal!A24&\" \"&taal!A36&\" :\"","v":"uitvoering lichtkoepel :"},null,null,null,null,null,null,1]
[null,null,{"$f":"IF(type=1,\"\",taal!A8&\" \"&taal!A36&\" :\")","v":"vorm lichtkoepel :"},null,null,null,null,null,null,1]
[null,null,{"$f":"taal!A55&\" \"&taal!A36&\" :\"","v":"kleur lichtkoepel :"},null,null,{"$f":"IF(OR(glas>2,type>2,AND(glas=2,type=1)),\"*\",IF(OR(kleur=1,kleur=3,kleur=5)=TRUE,taal!A56,\"*\"))","v":"*"},null,null,null,1]
[null,null,{"$f":"taal!A32&\" :\"","v":"dagmaat B :"},null,null,null,null,null,null,1]
[null,null,{"$f":"taal!A15&\" :\"","v":"opstand :"},null,null,{"$f":"'Skylux EP'!M73","v":5},null,{"$f":"IF(AND(OR(op=4,op=3),metaal>6),taal!A68,\"\")&IF(AND(OR(op=3,op=4),vorm=3),taal!$A$60,IF(AND(op=1,'Skylux EP'!R2='Skylux EP'!D5)=TRUE,taal!$A$35,IF(op=1,IF(AND(pvc=1,'Skylux EP'!$CC$1=0),taal!$A$35,IF(AND(pvc=2,'Skylux EP'!$CG$1=0),taal!$A$35,IF(AND(pvc=3,'Skylux EP'!$CK$1=0),taal!$A$35,IF(AND(pvc=4,'Skylux EP'!$BS$1=0),taal!$A$35,IF(AND(pvc=5,'Skylux EP'!$BY$1=0),taal!$A$35,\"*\"))))),IF(AND(op=2,prv=1,'Skylux EP'!$AT$1=0),taal!$A$35,IF(AND(op=2,prv>1,'Skylux EP'!$BC$1=0),taal!$A$35,\"*\")))))","v":"*"},null,1]
[null,null,{"$f":"taal!A16&\" :\"","v":"verhogingsopstand :"},null,null,{"$f":"'Skylux EP'!M73","v":5},null,null,null,1]
[null,null,{"$f":"taal!A63&\" :\"","v":"raam :"},null,null,null,null,{"$f":"IF(AND(OR(raam=2,raam=3),'Skylux EP'!R2='Skylux EP'!D5)=TRUE,taal!$A$35,\"*\")","v":"*"},null,1]
[null,null,{"$f":"taal!A64&\" :\"","v":"adapterraam :"},0,null,null,null,{"$f":"IF('Skylux EP'!R2='Skylux EP'!D5,taal!$A$35,\"*\")","v":"*"},null,1]
[null,null,{"$f":"taal!A71&\" :\"","v":"dikte dakisolatie :"},5,"cm",{"$f":"IF('Skylux EP'!O17=0,taal!A72,\"\")","v":""},null,null,null,1]
[null,null,null,null,null,null,null,null,null,1]
[null,null,null,{"$f":"taal!B39&\":\"","v":"oppervlakte:"},{"$f":"IF(glas>3,taal!A42,taal!A41&\":\")","v":"Ut-waarde:"},{"$f":"taal!A70&\":\"","v":"Uup-waarde:"},{"$f":"taal!A43&\":\"","v":"Ue-waarde:"},null,null,1]
[null,null,{"$f":"IF(AND(glas=1,type<8),taal!A36,IF(AND(glas=2,type=8),taal!A38,IF(AND(glas=2,type<8),taal!A37,INDEX('Skylux EP'!B2:B7,glas))))","v":"lichtkoepel"},{"$f":"'Skylux EP'!B122","v":1.1244441034190922},{"$f":"IF(glas=1,IF(AND(raam=4,vorm<>3,'Skylux EP'!K19>0),'Skylux EP'!D28,'Skylux EP'!B28),IF(glas=2,'Skylux EP'!C28,INDEX('Skylux EP'!C28:H28,glas)))","v":1.7},"-","-",null,null,1]
[null,null,{"$f":"taal!A47","v":"opstand"},{"$f":"'Skylux EP'!B75","v":0.60691553599999981},"-",{"$f":"IF(OR(H8=\"*\",metaal>6),'Skylux EP'!B74,\" ??? \")","v":0.61},"-",null,null,1]
[null,null,{"$f":"taal!A63","v":"raam"},{"$f":"IF(AND(glas=1,raam=1),\"-\",'Skylux EP'!$F$95)","v":"-"},"-","-",{"$f":"IF(AND(glas=1,raam=1),\"-\",IF(H10=\"*\",'Skylux EP'!$B$95,\"???\"))","v":"-"},null,null,1]
[null,null,{"$f":"taal!A64","v":"adapterraam"},{"$f":"IF(adap=1,\"-\",'Skylux EP'!$F$99)","v":"-"},"-","-",{"$f":"IF(adap=1,\"-\",IF(H11=\"*\",'Skylux EP'!$B$99,\"???\"))","v":"-"},null,null,{"$f":"IF(adap=2,1,0)","v":0}]
[null,null,null,{"$f":"taal!B39&\" (Arc) :\"","v":"oppervlakte (Arc) :"},{"$f":"taal!A44&\" :\"","v":"Urc-waarde  :"},null,{"$f":"taal!A46&\" :\"","v":"g-waarde  :"},null,null,1]
[null,null,{"$f":"INDEX('Skylux EP'!O2:O8,glas)&\" + \"&taal!A59&IF(raam>1,\" + \"&taal!B63,\" \")","v":"lichtkoepel + opstand "},{"$f":"ROUND(D15,2)+ROUND(D16,2)+IF(OR(glas>1,raam>1),D17,0)+IF(adap>1,D18,0)","v":1.73},{"$f":"'Skylux EP'!B143","v":1.4057006975102175},null,{"$f":"'Skylux EP'!M120","v":0.65},null,null,1]
[null,null,null,{"$f":"IF(glas<3,taal!B39&\" (Ap) :\",\"\")","v":"oppervlakte (Ap) :"},{"$f":"IF(glas<3,taal!A45&\" :\",\"\")","v":"Url-waarde :"},null,null,null,null,{"$f":"IF($J$1=TRUE,1,0)","v":0}]
[null,null,{"$f":"IF(glas<3,taal!A40,\"\")","v":"t.o.v. de geprojecteerde oppte"},{"$f":"IF(glas<3,IF('Skylux EP'!K19=0,E26*E26/40000*PI(),D26*E26/10000),\"\")","v":1},{"$f":"IF(glas<3,E20*D20/D22,\"\")","v":2.4318622066926765},null,null,null,null,{"$f":"IF($J$1=TRUE,1,0)","v":0}]
[null,null,null,null,null,null,null,null,null,1]
[null,null,{"$f":"taal!A18&\" :\"","v":"A - maat :"},{"$f":"IF('Skylux EP'!R2='Skylux EP'!D5,'Skylux EP'!D5,'Skylux EP'!R2+16)","v":116},{"$f":"'Skylux EP'!S2+16","v":116},null,null,null,null,{"$f":"IF(glas<4,1,0)","v":1}]
[null,null,{"$f":"taal!A19&\" :\"","v":"B - maat :"},{"$f":"'Skylux EP'!R2","v":100},{"$f":"'Skylux EP'!S2","v":100},null,null,null,null,1]
[null,null,{"$f":"taal!A20&\" :\"","v":"C - maat :"},{"$f":"IF('Skylux EP'!K19=0,'Skylux EP'!D5,'Skylux EP'!K19/10+'Skylux EP'!L73)","v":100},{"$f":"'Skylux EP'!L19/10+'Skylux EP'!L73","v":100},null,null,null,null,1]
[null,null,null,null,null,null,null,null,null,1]
[null,null,null,null,null,null,null,null,null,{"$f":"IF(glas=1,IF(AND(op=1,prvc=3,raam=1)=TRUE,1,0),0)","v":0}]
[null,null,null,null,null,null,null,null,null,{"$f":"IF(glas=1,IF(AND(op=1,prvc=2,raam=1)=TRUE,1,0),0)","v":0}]
[null,null,null,null,null,null,null,null,null,{"$f":"IF(glas=1,IF(AND(op=1,prvc=1,raam=1)=TRUE,1,0),0)","v":1}]
[null,null,null,null,null,null,null,null,null,{"$f":"IF(glas=1,IF(AND(op=1,prvc=4,raam=1)=TRUE,1,0),0)","v":0}]
[null,null,null,null,null,null,null,null,null,{"$f":"IF(glas=1,IF(AND(op=1,prvc=5,raam=1)=TRUE,1,0),0)","v":0}]
[null,null,null,null,null,null,null,null,null,{"$f":"IF(glas=1,IF(AND(op=2,prvc=1,raam=1)=TRUE,1,0),0)","v":0}]
[null,null,null,null,null,null,null,null,null,{"$f":"IF(glas=1,IF(AND(op=2,prvc=2,raam=1)=TRUE,1,0),0)","v":0}]
[null,null,null,null,null,null,null,null,null,{"$f":"IF(glas=1,IF(AND(op=2,prvc=3,raam=1)=TRUE,1,0),0)","v":0}]
[null,null,null,null,null,null,null,null,null,{"$f":"IF(glas=1,IF(AND(op=2,prvc=4,raam=1)=TRUE,1,0),0)","v":0}]
[null,null,null,null,null,null,null,null,null,{"$f":"IF(glas=1,IF(AND(op=2,prvc=5,raam=1)=TRUE,1,0),0)","v":0}]
[null,null,null,null,null,null,null,null,null,{"$f":"IF(glas=1,IF(AND(op=2,prvc=6,raam=1)=TRUE,1,0),0)","v":0}]
[null,null,null,null,null,null,null,null,null,{"$f":"IF(glas=1,IF(AND(op=3,raam=1)=TRUE,1,0),0)","v":0}]
[null,null,null,null,null,null,null,null,null,{"$f":"IF(glas=1,IF(AND(op=4,raam=1)=TRUE,1,0),0)","v":0}]
[null,null,null,null,null,null,null,null,null,{"$f":"IF(glas=1,IF(AND(op=2,prvc=7,raam=1)=TRUE,1,0),0)","v":0}]
[null,null,null,null,null,null,null,null,null,{"$f":"IF(glas=1,IF(AND(op=2,prvc=8,raam=1)=TRUE,1,0),0)","v":0}]
[null,null,null,null,null,null,null,null,null,{"$f":"IF(glas=1,IF(AND(op=1,prvc=3,raam>1,raam<>4)=TRUE,1,0),0)","v":0}]
[null,null,null,null,null,null,null,null,null,{"$f":"IF(glas=1,IF(AND(op=1,prvc=2,raam>1,raam<>4)=TRUE,1,0),0)","v":0}]
[null,null,null,null,null,null,null,null,null,{"$f":"IF(glas=1,IF(AND(op=1,prvc=1,raam=2)=TRUE,1,0),0)","v":0}]
[null,null,null,null,null,null,null,null,null,{"$f":"IF(glas=1,IF(AND(op=1,prvc=4,raam>1,raam<>4)=TRUE,1,0),0)","v":0}]
[null,null,null,null,null,null,null,null,null,{"$f":"IF(glas=1,IF(AND(op=1,prvc=5,raam>1,raam<>4)=TRUE,1,0),0)","v":0}]
[null,null,null,null,null,null,null,null,null,{"$f":"IF(glas=1,IF(AND(op=2,prvc=1,raam>1,OR(raam<>4,'Skylux EP'!K19=0))=TRUE,1,0),0)","v":0}]
[null,null,null,null,null,null,null,null,null,{"$f":"IF(glas=1,IF(AND(op=2,prvc=2,raam>1,OR(raam<>4,'Skylux EP'!K19=0))=TRUE,1,0),0)","v":0}]
[null,null,null,null,null,null,null,null,null,{"$f":"IF(glas=1,IF(AND(op=2,prvc=3,raam>1,OR(raam<>4,'Skylux EP'!K19=0))=TRUE,1,0),0)","v":0}]
[null,null,null,null,null,null,null,null,null,{"$f":"IF(glas=1,IF(AND(op=2,prvc=4,raam>1,OR(raam<>4,'Skylux EP'!K19=0))=TRUE,1,0),0)","v":0}]
[null,null,null,null,null,null,null,null,null,{"$f":"IF(glas=1,IF(AND(op=2,prvc=5,raam>1,OR(raam<>4,'Skylux EP'!K19=0))=TRUE,1,0),0)","v":0}]
[null,null,null,null,null,null,null,null,null,{"$f":"IF(glas=1,IF(AND(op=2,prvc=6,raam>1,OR(raam<>4,'Skylux EP'!K19=0))=TRUE,1,0),0)","v":0}]
[null,null,null,null,null,null,null,null,null,{"$f":"IF(glas=1,IF(AND(op=2,prvc=7,raam>1,OR(raam<>4,'Skylux EP'!K19=0))=TRUE,1,0),0)","v":0}]
[null,null,null,null,null,null,null,null,null,{"$f":"IF(glas=1,IF(AND(op=2,prvc=8,raam>1,OR(raam<>4,'Skylux EP'!K19=0))=TRUE,1,0),0)","v":0}]
[null,null,null,null,null,null,null,null,null,{"$f":"IF(glas=1,IF(AND(op=3,raam>1,OR(raam<>4,'Skylux EP'!K19=0))=TRUE,1,0),0)","v":0}]
[null,null,null,null,null,null,null,null,null,{"$f":"IF(glas=1,IF(AND(op=4,raam>1,OR(raam<>4,'Skylux EP'!K19=0))=TRUE,1,0),0)","v":0}]
[null,null,null,null,null,null,null,null,null,{"$f":"IF(AND(glas=1,op=1,prvc=1,raam=4),1,0)","v":0}]
[null,null,null,null,null,null,null,null,null,{"$f":"IF(AND(glas=1,op=1,prvc=2,raam=4),1,0)","v":0}]
[null,null,null,null,null,null,null,null,null,{"$f":"IF(AND(glas=1,op=1,prvc=3,raam=4),1,0)","v":0}]
[null,null,null,null,null,null,null,null,null,{"$f":"IF(AND(glas=1,op=1,prvc=4,raam=4),1,0)","v":0}]
[null,null,null,null,null,null,null,null,null,{"$f":"IF(AND(glas=1,op=1,prvc=5,raam=4),1,0)","v":0}]
[null,null,null,null,null,null,null,null,null,{"$f":"IF(AND(glas=1,op=2,prvc=1,raam=4),1,0)","v":0}]
[null,null,null,null,null,null,null,null,null,{"$f":"IF(AND(glas=1,op=2,prvc=2,raam=4),1,0)","v":0}]
[null,null,null,null,null,null,null,null,null,{"$f":"IF(AND(glas=1,op=2,prvc=3,raam=4),1,0)","v":0}]
[null,null,null,null,null,null,null,null,null,{"$f":"IF(AND(glas=1,op=2,prvc=7,raam=4),1,0)","v":0}]
[null,null,null,null,null,null,null,null,null,{"$f":"IF(AND(glas=1,op=2,prvc=8,raam=4),1,0)","v":0}]
[null,null,null,null,null,null,null,null,null,{"$f":"IF(AND(glas=1,op=3,raam=4),1,0)","v":0}]
[null,null,null,null,null,null,null,null,null,{"$f":"IF(AND(glas=1,op=4,raam=4),1,0)","v":0}]
[null,null,null,null,null,null,null,null,null,{"$f":"IF(AND(glas=1,op=1,prvc=1,raam=3),1,0)","v":0}]
[null,null,null,null,null,null,null,null,null,{"$f":"IF(AND(glas=1,op=1,prvc=2,raam=3),1,0)","v":0}]
[null,null,null,null,null,null,null,null,null,{"$f":"IF(AND(glas=1,op=1,prvc=3,raam=3),1,0)","v":0}]
[null,null,null,null,null,null,null,null,null,{"$f":"IF(AND(glas=1,op=1,prvc=4,raam=3),1,0)","v":0}]
[null,null,null,null,null,null,null,null,null,{"$f":"IF(AND(glas=1,op=1,prvc=5,raam=3),1,0)","v":0}]
[null,null,null,null,null,null,null,null,null,{"$f":"IF(AND(glas=1,op=2,prvc=1,raam=3),1,0)","v":0}]
[null,null,null,null,null,null,null,null,null,{"$f":"IF(AND(glas=1,op=2,prvc=2,raam=3),1,0)","v":0}]
[null,null,null,null,null,null,null,null,null,{"$f":"IF(AND(glas=1,op=2,prvc=3,raam=3),1,0)","v":0}]
[null,null,null,null,null,null,null,null,null,{"$f":"IF(AND(glas=1,op=2,prvc=4,raam=3),1,0)","v":0}]
[null,null,null,null,null,null,null,null,null,{"$f":"IF(AND(glas=1,op=2,prvc=5,raam=3),1,0)","v":0}]
[null,null,null,null,null,null,null,null,null,{"$f":"IF(AND(glas=1,op=2,prvc=6,raam=3),1,0)","v":0}]
[null,null,null,null,null,null,null,null,null,{"$f":"IF(AND(glas=1,op=2,prvc=7,raam=3),1,0)","v":0}]
[null,null,null,null,null,null,null,null,null,{"$f":"IF(AND(glas=1,op=2,prvc=8,raam=3),1,0)","v":0}]
[null,null,null,null,null,null,null,null,null,{"$f":"IF(AND(glas=1,op=3,raam=3),1,0)","v":0}]
[null,null,null,null,null,null,null,null,null,{"$f":"IF(AND(glas=1,op=4,raam=3),1,0)","v":0}]
[null,null,null,null,null,null,null,null,null,{"$f":"IF(AND(glas=3,op=1,prvc=2,raam=8)=TRUE,1,0)","v":0}]
[null,null,null,null,null,null,null,null,null,{"$f":"IF(AND(glas=3,op=1,prvc=1,raam=8)=TRUE,1,0)","v":0}]
[null,null,null,null,null,null,null,null,null,{"$f":"IF(AND(glas=3,op=1,prvc=4,raam=8)=TRUE,1,0)","v":0}]
[null,null,null,null,null,null,null,null,null,{"$f":"IF(AND(glas=3,op=1,prvc=5,raam=8)=TRUE,1,0)","v":0}]
[null,null,null,null,null,null,null,null,null,{"$f":"IF(AND(glas=3,op=2,prvc=1,raam=8)=TRUE,1,0)","v":0}]
[null,null,null,null,null,null,null,null,null,{"$f":"IF(AND(glas=3,op=2,prvc=2,raam=8)=TRUE,1,0)","v":0}]
[null,null,null,null,null,null,null,null,null,{"$f":"IF(AND(glas=3,op=2,prvc=3,raam=8)=TRUE,1,0)","v":0}]
[null,null,null,null,null,null,null,null,null,{"$f":"IF(AND(glas=3,op=2,prvc=4,raam=8)=TRUE,1,0)","v":0}]
[null,null,null,null,null,null,null,null,null,{"$f":"IF(AND(op=2,prvc=5,raam=8)=TRUE,1,0)","v":0}]
[null,null,null,null,null,null,null,null,null,{"$f":"IF(AND(glas=3,op=2,prvc=6,raam=8)=TRUE,1,0)","v":0}]
[null,null,null,null,null,null,null,null,null,{"$f":"IF(AND(glas=3,op=2,prvc=7,raam=8)=TRUE,1,0)","v":0}]
[null,null,null,null,null,null,null,null,null,{"$f":"IF(AND(glas=3,op=2,prvc=8,raam=8)=TRUE,1,0)","v":0}]
[null,null,null,null,null,null,null,null,null,{"$f":"IF(AND(glas=3,op=3,raam=8),1,0)","v":0}]
[null,null,null,null,null,null,null,null,null,{"$f":"IF(AND(glas=3,op=4,raam=8),1,0)","v":0}]
[null,null,null,null,null,null,null,null,null,{"$f":"IF(glas=3,IF(AND(op=1,pvc=3,raam=7),1,0),0)","v":0}]
[null,null,null,null,null,null,null,null,null,{"$f":"IF(glas=3,IF(AND(op=1,pvc=2,raam=7),1,0),0)","v":0}]
[null,null,null,null,null,null,null,null,null,{"$f":"IF(glas=3,IF(AND(op=1,pvc=1,raam=7),1,0),0)","v":0}]
[null,null,null,null,null,null,null,null,null,{"$f":"IF(glas=3,IF(AND(op=1,pvc=4,raam=7),1,0),0)","v":0}]
[null,null,null,null,null,null,null,null,null,{"$f":"IF(glas=3,IF(AND(op=1,pvc=5,raam=7),1,0),0)","v":0}]
[null,null,null,null,null,null,null,null,null,{"$f":"IF(glas=2,IF(AND(op=1,pvc=1,raam=5),1,0),0)","v":0}]
[null,null,null,null,null,null,null,null,null,{"$f":"IF(glas=2,IF(AND(op=1,pvc=2,raam=5),1,0),0)","v":0}]
[null,null,null,null,null,null,null,null,null,{"$f":"IF(glas=2,IF(AND(op=1,pvc=4,raam=5),1,0),0)","v":0}]
[null,null,null,null,null,null,null,null,null,{"$f":"IF(glas=2,IF(AND(op=1,pvc=5,raam=5),1,0),0)","v":0}]
[null,null,null,null,null,null,null,null,null,{"$f":"IF(glas=2,IF(AND(op=1,pvc=1,raam=6),1,0),0)","v":0}]
[null,null,null,null,null,null,null,null,null,{"$f":"IF(glas=2,IF(AND(op=1,pvc=2,raam=6),1,0),0)","v":0}]
[null,null,null,null,null,null,null,null,null,{"$f":"IF(glas=2,IF(AND(op=1,pvc=4,raam=6),1,0),0)","v":0}]
[null,null,null,null,null,null,null,null,null,{"$f":"IF(glas=2,IF(AND(op=1,pvc=5,raam=6),1,0),0)","v":0}]
[null,null,null,null,null,null,null,null,null,{"$f":"IF(OR(glas=4,glas=6),IF(AND(op=1,pvc=3,OR(raam=7,raam=9)),1,0),0)","v":0}]
[null,null,null,null,null,null,null,null,null,{"$f":"IF(OR(glas=4,glas=6),IF(AND(op=1,pvc=2,OR(raam=7,raam=9)),1,0),0)","v":0}]
[null,null,null,null,null,null,null,null,null,{"$f":"IF(OR(glas=4,glas=6),IF(AND(op=1,pvc=1,OR(raam=7,raam=9)),1,0),0)","v":0}]
[null,null,null,null,null,null,null,null,null,{"$f":"IF(OR(glas=4,glas=6),IF(AND(op=1,pvc=4,OR(raam=7,raam=9)),1,0),0)","v":0}]
[null,null,null,null,null,null,null,null,null,{"$f":"IF(OR(glas=4,glas=6),IF(AND(op=1,pvc=5,OR(raam=7,raam=9)),1,0),0)","v":0}]
[null,null,null,null,null,null,null,null,null,{"$f":"IF(glas=5,IF(AND(op=1,pvc=3,raam=11),1,0),0)","v":0}]
[null,null,null,null,null,null,null,null,null,{"$f":"IF(glas=5,IF(AND(op=1,pvc=2,raam=11),1,0),0)","v":0}]
[null,null,null,null,null,null,null,null,null,{"$f":"IF(glas=5,IF(AND(op=1,pvc=1,raam=11),1,0),0)","v":0}]
[null,null,null,null,null,null,null,null,null,{"$f":"IF(glas=5,IF(AND(op=1,pvc=4,raam=11),1,0),0)","v":0}]
[null,null,null,null,null,null,null,null,null,{"$f":"IF(glas=5,IF(AND(op=1,pvc=5,raam=11),1,0),0)","v":0}]
[null,null,null,null,null,null,null,null,null,{"$f":"IF(glas=4,IF(AND(op=1,pvc=1,raam=10),1,0),0)","v":0}]
[null,null,null,null,null,null,null,null,null,{"$f":"IF(glas=4,IF(AND(op=1,pvc=2,raam=10),1,0),0)","v":0}]
[null,null,null,null,null,null,null,null,null,{"$f":"IF(glas=4,IF(AND(op=1,pvc=4,raam=10),1,0),0)","v":0}]
[null,null,null,null,null,null,null,null,null,{"$f":"IF(glas=4,IF(AND(op=1,pvc=5,raam=10),1,0),0)","v":0}]
[null,null,null,null,null,null,null,null,null,{"$f":"IF(glas=4,IF(AND(op=2,prv=1,raam=10),1,0),0)","v":0}]
[null,null,null,null,null,null,null,null,null,{"$f":"IF(glas=4,IF(AND(op=2,prv=2,raam=10),1,0),0)","v":0}]
[null,null,null,null,null,null,null,null,null,{"$f":"IF(glas=4,IF(AND(op=2,prv=3,raam=10),1,0),0)","v":0}]
[null,null,null,null,null,null,null,null,null,{"$f":"IF(glas=4,IF(AND(op=2,prv=4,raam=10),1,0),0)","v":0}]
[null,null,null,null,null,null,null,null,null,{"$f":"IF(glas=4,IF(AND(op=2,prv=5,raam=10),1,0),0)","v":0}]
[null,null,null,null,null,null,null,null,null,{"$f":"IF(glas=4,IF(AND(op=2,prv=6,raam=10),1,0),0)","v":0}]
[null,null,null,null,null,null,null,null,null,{"$f":"IF(glas=4,IF(AND(op=2,prv=7,raam=10),1,0),0)","v":0}]
[null,null,null,null,null,null,null,null,null,{"$f":"IF(glas=4,IF(AND(op=2,prv=8,raam=10),1,0),0)","v":0}]
[null,null,null,null,null,null,null,null,null,{"$f":"IF(glas=4,IF(AND(op=3,raam=10),1,0),0)","v":0}]
[null,null,null,null,null,null,null,null,null,{"$f":"IF(glas=4,IF(AND(op=4,raam=10),1,0),0)","v":0}]
[null,null,null,null,null,null,null,null,null,{"$f":"IF(glas=5,IF(AND(op=1,pvc=1,raam=12),1,0),0)","v":0}]
[null,null,null,null,null,null,null,null,null,{"$f":"IF(glas=5,IF(AND(op=1,pvc=2,raam=12),1,0),0)","v":0}]
[null,null,null,null,null,null,null,null,null,{"$f":"IF(glas=5,IF(AND(op=1,pvc=4,raam=12),1,0),0)","v":0}]
[null,null,null,null,null,null,null,null,null,{"$f":"IF(glas=5,IF(AND(op=1,pvc=5,raam=12),1,0),0)","v":0}]
[null,null,null,null,null,null,null,null,null,{"$f":"IF(glas=5,IF(AND(op=2,prv=1,raam=12),1,0),0)","v":0}]
[null,null,null,null,null,null,null,null,null,{"$f":"IF(glas=5,IF(AND(op=2,prv=2,raam=12),1,0),0)","v":0}]
[null,null,null,null,null,null,null,null,null,{"$f":"IF(glas=5,IF(AND(op=2,prv=3,raam=12),1,0),0)","v":0}]
[null,null,null,null,null,null,null,null,null,{"$f":"IF(glas=5,IF(AND(op=2,prv=4,raam=12),1,0),0)","v":0}]
[null,null,null,null,null,null,null,null,null,{"$f":"IF(glas=5,IF(AND(op=2,prv=5,raam=12),1,0),0)","v":0}]
[null,null,null,null,null,null,null,null,null,{"$f":"IF(glas=5,IF(AND(op=2,prv=6,raam=12),1,0),0)","v":0}]
[null,null,null,null,null,null,null,null,null,{"$f":"IF(glas=5,IF(AND(op=2,prv=7,raam=12),1,0),0)","v":0}]
[null,null,null,null,null,null,null,null,null,{"$f":"IF(glas=5,IF(AND(op=2,prv=8,raam=12),1,0),0)","v":0}]
[null,null,null,null,null,null,null,null,null,{"$f":"IF(glas=5,IF(AND(op=3,raam=12),1,0),0)","v":0}]
[null,null,null,null,null,null,null,null,null,{"$f":"IF(glas=5,IF(AND(op=4,raam=12),1,0),0)","v":0}]
[{"$f":"\"        \"&taal!A66","v":"        Skylux heeft het grootste gamma CE gekeurde lichtkoepels voor elk project."},null,null,null,null,null,null,null,null,1]

{"sheet":"Skylux EP","index":1,"n_rows":144,"n_cols":107,"rows_kept":144,"cut":false,"hidden":false,"merged":[[1,29,1,30],[0,27,0,30],[143,4,143,6],[0,85,0,87],[0,89,0,91],[142,4,142,6],[141,4,141,6],[0,71,0,73],[0,77,0,79],[0,81,0,83],[0,35,0,36],[0,33,0,34],[0,21,0,26],[1,21,1,22],[1,23,1,24],[1,25,1,26],[1,27,1,28]]}
[1,1,5,1,1,1,1,{"$f":"prvc","v":1},{"$f":"prvc","v":1},{"$f":"prvc","v":1},{"$f":"prvc","v":1},1,1,1,{"$f":"glas","v":1},1,null,12,null,"List dimensions",null,"standard dome",null,null,null,null,null,"pyramidal dome",null,null,null,"EP10  / EP 16",null,"4 Walled ",null,"5 Walled ",null,"Skylux Pergotop",null,"iDome / iWindow2",null,"iWindow3",null,"Vitria",null,{"$f":"IF(AND(op=2,AT2>1,prv=1),1,0)","v":0},{"$f":"IF(AND(op=1,pvc=1)=TRUE,20,IF(OR(op=3,AND(op=1,pvc=2))=TRUE,0,IF(AND(op=1,pvc=3)=TRUE,20,IF(AND(op=1,pvc=4)=TRUE,30,IF(AND(op=2,prv=1)=TRUE,25,20)))))","v":20},{"$f":"IF(AND(op=1,pvc=1)=TRUE,20,IF(OR(op=3,AND(op=1,pvc=2))=TRUE,0,IF(AND(op=1,pvc=3)=TRUE,20,IF(AND(op=1,pvc=4)=TRUE,30,IF(AND(op=2,prv=1)=TRUE,25,20)))))","v":20},"Standard GRP Curbs",null,null,null,null,null,{"$f":"IF(AND(op=2,BF2>1,prv=2)=TRUE,1,IF(AND(op=2,BG2>1,prv=3)=TRUE,1,IF(AND(op=2,BH2>1,prv=4)=TRUE,1,IF(AND(op=2,BI2>1,prv=5)=TRUE,1,IF(AND(op=2,BJ2>1,prv=6)=TRUE,1,IF(AND(op=2,BK2>1,prv=7)=TRUE,1,IF(AND(op=2,BL2>1,prv=8)=TRUE,1,0)))))))","v":0},"GRP Curbs",null,"15/20",3020,"D30 EP60","D30 EP100","D50/20","D30/00","D50/00",{"$f":"prv","v":1},null,null,"PVC Curbs",null,null,{"$f":"IF(AND(op=1,BS2>1,pvc=4),1,0)","v":0},"pvc 30/20",null,null,null,null,{"$f":"IF(AND(op=1,BY2>1,pvc=5),1,0)","v":0},"pvc 35/30",null,null,{"$f":"IF(AND(op=1,CC2>1,pvc=1),1,0)","v":1},"pvc 20/00EP",null,null,{"$f":"IF(AND(op=1,CG2>1,pvc=2),1,0)","v":0},"pvc 16/20EP",null,null,{"$f":"IF(AND(op=1,CK2>1,pvc=3),1,0)","v":0},"pvc 16/00",null,null,null,null,"Skin","skinheight",null,null,{"$f":"$CU$2","v":22},null,null,null,null,"EP25 frame"]
["Nederlands",{"$f":"\"Skylux\"&\" \"&taal!A57","v":"Skylux lichtkoepel"},{"$f":"IF(glas>3,\"*\",taal!A25)","v":"EP10 koepel"},{"$f":"IF(glas>3,\"*\",taal!A3)","v":"bol"},{"$f":"IF(OR(type=1,type=2,type=3,type=4,glas>1),\"*\",taal!A5)","v":"vierkant"},{"$f":"IF(K19=0,taal!A69,taal!A10)","v":"pvc-opstand"},{"$f":"IF(op=1,H2,IF(op=2,I2,IF(op=3,J2,K2)))","v":"pvc 20/00 EP"},{"$f":"IF(K19=0,taal!A69,\"pvc 20/00 EP\")","v":"pvc 20/00 EP"},{"$f":"IF(F3=\"*\",\"*\",\"PO 15/25\")","v":"PO 15/25"},{"$f":"IF(F4=\"*\",\"*\",\"M15\")","v":"M15"},{"$f":"IF(F5=\"*\",\"*\",\"M15 EP\")","v":"M15 EP"},{"$f":"IF(glas=2,taal!A51,IF(glas>3,taal!A48,IF(OR(type=1,type=2),taal!A61,taal!A48&\" \"&taal!A53)))","v":"helder PMMA"},{"$f":"IF(glas>=2,taal!A69,taal!A17)","v":"geen"},{"$f":"taal!A17","v":"geen"},{"$f":"taal!A57","v":"lichtkoepel"},{"$f":"taal!A17","v":"geen"},{"$f":"R2 &\"   \"&S2","v":"100   100"},{"$f":"INDEX(R4:R150,R1)","v":100},{"$f":"INDEX(S4:S150,R1)","v":100},null,null,"square",null,"rectangular",null,"round",null,"square",null,"rectangular",null,null,null,null,null,null,null,null,null,null,null,null,null,null,null,{"$f":"IF(ISNA(VLOOKUP($Q$2,$AT$4:$AY$129,6,FALSE))=TRUE,0,VLOOKUP($Q$2,$AT$4:$AY$129,6,FALSE))","v":2},null,null,null,null,"H15/25",null,null,null,null,null,null,{"$f":"IF(ISNA(VLOOKUP($Q$2,$BC$4:$BJ$123,4,FALSE))=TRUE,0,VLOOKUP($Q$2,$BC$4:$BJ$123,4,FALSE))","v":2},{"$f":"IF(ISNA(VLOOKUP($Q$2,$BC$4:$BJ$123,5,FALSE))=TRUE,0,VLOOKUP($Q$2,$BC$4:$BJ$123,5,FALSE))","v":2},{"$f":"IF(ISNA(VLOOKUP($Q$2,$BC$4:$BJ$123,6,FALSE))=TRUE,0,VLOOKUP($Q$2,$BC$4:$BJ$123,6,FALSE))","v":2},{"$f":"IF(ISNA(VLOOKUP($Q$2,$BC$4:$BJ$123,7,FALSE))=TRUE,0,VLOOKUP($Q$2,$BC$4:$BJ$123,7,FALSE))","v":2},{"$f":"IF(ISNA(VLOOKUP($Q$2,$BC$4:$BJ$123,8,FALSE))=TRUE,0,VLOOKUP($Q$2,$BC$4:$BJ$123,8,FALSE))","v":2},{"$f":"IF(ISNA(VLOOKUP($Q$2,$BC$4:$BK$123,9,FALSE))=TRUE,0,VLOOKUP($Q$2,$BC$4:$BK$123,9,FALSE))","v":2},{"$f":"IF(ISNA(VLOOKUP($Q$2,$BC$4:$BL$123,10,FALSE))=TRUE,0,VLOOKUP($Q$2,$BC$4:$BL$123,10,FALSE))","v":2},null,null,null,null,null,null,{"$f":"IF(ISNA(VLOOKUP($Q$2,$BN$4:$BS$122,6,FALSE))=TRUE,0,VLOOKUP($Q$2,$BN$4:$BS$122,6,FALSE))","v":2},null,null,null,null,null,{"$f":"IF(ISNA(VLOOKUP($Q$2,$BN$4:$BY$122,12,FALSE))=TRUE,0,VLOOKUP($Q$2,$BN$4:$BY$122,12,FALSE))","v":2},null,null,null,{"$f":"IF(ISNA(VLOOKUP($Q$2,$BN$4:$CC$122,16,FALSE))=TRUE,0,VLOOKUP($Q$2,$BN$4:$CC$122,16,FALSE))","v":2},null,null,null,{"$f":"IF(ISNA(VLOOKUP($Q$2,$BN$4:$CG$122,20,FALSE))=TRUE,0,VLOOKUP($Q$2,$BN$4:$CG$122,20,FALSE))","v":2},null,null,null,{"$f":"IF(ISNA(VLOOKUP($Q$2,$BN$4:$CK$122,24,FALSE))=TRUE,0,VLOOKUP($Q$2,$BN$4:$CK$122,24,FALSE))","v":2},null,null,null,null,null,null,"OS","IS1","IS2",{"$f":"IF(OR(AND(OR(type=4,type=3),K19=0),vorm=3),CU44,IF(vorm=1,CU3,IF(vorm=2,CU27,\"VORM\")))","v":22},{"$f":"IF(OR(vorm=3,AND(type=3,K19=0)),CV44,IF(vorm=1,CV3,IF(vorm=2,CV27,\"VORM\")))","v":15},{"$f":"IF(OR(vorm=3,AND(type=3,K19=0)),CW44,IF(vorm=1,CW3,IF(vorm=2,CW27,\"VORM\")))","v":12},null,null,{"$f":"R2&S2","v":"100100"}]
["Français",{"$f":"\"Skylux\"&\" \"&taal!A58","v":"Skylux Pergotop IP32/IP89"},{"$f":"IF(glas>3,\"*\",taal!A69)","v":"maak andere keuze!"},{"$f":"IF(OR(glas>3,type=1,type=2,type=3,type=4),\"*\",taal!A4)","v":"piramide"},{"$f":"IF(OR(type=1,type=2,type=3,type=4,glas>1),\"*\",taal!A6)","v":"rechthoekig"},{"$f":"taal!A11","v":"polyesteropstand"},{"$f":"IF(op=1,H3,IF(op=2,I3,IF(op=3,J3,K3)))","v":"pvc 16/20 EP"},{"$f":"IF(K19=0,taal!A69,\"pvc 16/20 EP\")","v":"pvc 16/20 EP"},{"$f":"IF(F3=\"*\",\"*\",\"PO 15/20\")","v":"PO 15/20"},{"$f":"IF(F4=\"*\",\"*\",\"M20\")","v":"M20"},{"$f":"IF(F5=\"*\",\"*\",\"M20 EP\")","v":"M20 EP"},{"$f":"IF(OR(glas=2,glas=6),taal!A69,IF(glas>3,taal!A49,IF(type=2,taal!A61,taal!A49&\" \"&taal!A53)))","v":"opaal PMMA"},{"$f":"IF(K19=0,taal!A69,IF(glas=1,A80,taal!A69))","v":"pvc"},{"$f":"IF(K19=0,taal!A17,\"pvc 20/00 EP-S\")","v":"pvc 20/00 EP-S"},"*",{"$f":"IF(K19=0,taal!A17,taal!A64)","v":"adapterraam"},null,null,null,null,null,null,null,null,null,null,null,null,null,null,null,null,null,null,null,null,null,null,null,null,null,null,null,null,null,null,null,null,null,null,"fix","st frame","EP frame","EP25 frame",null,null,null,null,null,null,null,null,null,null,null,null,"DAGMAAT",null,"DAKOPENING","C = B + 20",3020,"st","ep","ep25","DAKOPENING","C = B + 30",3530,"st","ep","ep25","2000EP","st"," ep","ep25","1620EP","st","ep","ep25",1600,"st"," ep","ep25",null,"Square",300,12.5,9,5,{"$f":"VLOOKUP(K19,CQ3:CT25,2)","v":22},{"$f":"VLOOKUP(K19,CQ3:CT25,3)","v":15},{"$f":"VLOOKUP(K19,CQ3:CT25,4)","v":12},null,null,{"$f":"CZ2*1","v":100100},{"$f":"IF(ISNA(VLOOKUP(CZ3,CZ5:DD113,4,FALSE))=TRUE,taal!A69,VLOOKUP(CZ3,CZ5:DD113,4,FALSE)&\" \"&taal!A49)","v":"pvc EP 25 opaal"}]
["Deutsch","Skylux iDome",{"$f":"IF(glas>3,\"*\",taal!A27)","v":"vijfwandig"},null,{"$f":"IF(OR(type=1,type=2,type=3,type=4,glas>1),taal!A69,IF(D1=2,taal!A9,taal!A7))","v":"rond"},{"$f":"taal!A12","v":"metalen opstand"},{"$f":"IF(op=1,H4,IF(op=2,I4,IF(op=3,J4,K4)))","v":"pvc 16/00"},{"$f":"IF(K19=0,taal!A69,IF(glas>=2,taal!A69,\"pvc 16/00\"))","v":"pvc 16/00"},{"$f":"IF(F3=\"*\",\"*\",\"PO 30/20\")","v":"PO 30/20"},{"$f":"IF(F4=\"*\",\"*\",\"M25\")","v":"M25"},{"$f":"IF(F5=\"*\",\"*\",\"M25 EP\")","v":"M25 EP"},{"$f":"IF(OR(glas=2,glas=6),taal!A69,IF(glas>3,taal!A52,IF(OR(type=1,type=2),taal!A61,taal!A48&\" \"&taal!A54)))","v":"helder PC"},{"$f":"IF(K19=0,taal!A69,IF(glas=1,A81,taal!A69))","v":"pvc EP high"},null,"iDome",null,{"$f":"R4 &\"   \"&S4","v":"30   30"},{"$f":"IF(glas=6,AR4,IF(glas=5,AP4,IF(glas>2,AN4,IF(glas>1,AL4,IF(T4=0,\"\",T4)))))","v":30},{"$f":"IF(glas=6,AS4,IF(glas=5,AQ4,IF(glas>2,AO4,IF(glas>1,AM4,IF(U4=0,\"\",U4)))))","v":30},{"$f":"IF(OR(type=1,type=2),AF4,IF(type=3,AJ4,IF(type=4,AH4,IF(AND(bol=1,vorm=3)=TRUE,Z4,IF(AND(bol=1,vorm=1)=TRUE,V4,IF(AND(bol=1,vorm=2)=TRUE,X4,IF(AND(bol=2,vorm=1)=TRUE,AB4,IF(AND(bol=2,vorm=2)=TRUE,AD4,\"\"))))))))","v":30},{"$f":"IF(OR(type=1,type=2),AG4,IF(type=3,AK4,IF(type=4,AI4,IF(AND(bol=1,vorm=3)=TRUE,AA4,IF(AND(bol=1,vorm=1)=TRUE,W4,IF(AND(bol=1,vorm=2)=TRUE,Y4,IF(AND(bol=2,vorm=1)=TRUE,AC4,IF(AND(bol=2,vorm=2)=TRUE,AE4,\"\"))))))))","v":30},30,30,30,80,"Ø",40,40,40,40,70,{"$f":"IF(type=2,\"*\",40)","v":40},{"$f":"IF(type=2,\"*\",40)","v":40},30,80,{"$f":"IF(OR(kleur=3,kleur=4),\"*\",\"Ø\")","v":"Ø"},{"$f":"IF(OR(kleur=3,kleur=4),\"*\",40)","v":40},60,60,40,40,40,40,40,40,{"$f":"AU4&\"   \"&AV4","v":"30   30"},30,30,{"$f":"AU4+25","v":55},{"$f":"AV4+25","v":55},2,2,null,null,{"$f":"BD4-20&\"   \"&BE4-20","v":"30   30"},50,50,2,0,null,null,0,null,null,null,{"$f":"BO4&\"   \"&BP4","v":"30   30"},30,30,{"$f":"BO4+20","v":50},{"$f":"BP4+20","v":50},null,null,null,null,{"$f":"BO4+30","v":60},{"$f":"BP4+30","v":60},null,null,null,null,null,null,null,null,null,null,null,null,2,2,2,2,null,null,400,15,9,5]
["English","Skylux iWindow2",{"$f":"IF(glas>3,\"*\",taal!A28)","v":"vierwandig"},"Ø",null,{"$f":"taal!A13","v":"metalen opstand EP"},{"$f":"IF(op=1,H5,IF(op=2,I5,IF(op=3,J5,K5)))","v":"pvc 30/20"},{"$f":"IF(K19=0,taal!A69,\"pvc 30/20\")","v":"pvc 30/20"},{"$f":"IF(F3=\"*\",\"*\",\"PO 30/20 EP60\")","v":"PO 30/20 EP60"},{"$f":"IF(F4=\"*\",\"*\",\"M30\")","v":"M30"},{"$f":"IF(F5=\"*\",\"*\",\"M30 EP\")","v":"M30 EP"},{"$f":"IF(glas=2,taal!A69,IF(glas>3,taal!A69,taal!A49&\" \"&taal!A54))","v":"opaal PC"},{"$f":"IF(K19=0,taal!A69,IF(glas=1,A82,taal!A69))","v":"pvc EP25 high"},null,"iWindow2",null,{"$f":"R5 &\"   \"&S5","v":"40   40"},40,40,40,40,40,40,30,90,"Ø",50,50,50,40,100,{"$f":"IF(type=2,\"*\",50)","v":50},{"$f":"IF(type=2,\"*\",50)","v":50},30,90,40,40,60,80,40,70,40,70,40,70,{"$f":"AU5&\"   \"&AV5","v":"40   40"},40,40,{"$f":"AU5+25","v":65},{"$f":"AV5+25","v":65},2,2,2,2,{"$f":"BD5-20&\"   \"&BE5-20","v":"40   40"},60,60,2,2,2,2,2,2,2,null,{"$f":"BO5&\"   \"&BP5","v":"40   40"},40,40,{"$f":"BO5+20","v":60},{"$f":"BP5+20","v":60},2,2,2,2,70,70,null,null,null,null,2,2,2,2,2,2,2,2,2,2,2,2,null,null,450,14,10,6]
["Hrvatski","Skylux iWindow3",{"$f":"IF(glas>3,\"*\",taal!A29)","v":"driewandig"},null,null,{"$f":"taal!A14","v":"eigen opstand"},{"$f":"IF(op=1,H6,IF(op=2,I6,IF(op=3,J6,K6)))","v":"pvc 35/30"},{"$f":"IF(K19=0,taal!A69,\"pvc 35/30\")","v":"pvc 35/30"},{"$f":"IF(F3=\"*\",\"*\",\"PO 30/20 EP100\")","v":"PO 30/20 EP100"},{"$f":"IF(F4=\"*\",\"*\",\"M40\")","v":"M40"},{"$f":"IF(F5=\"*\",\"*\",\"M40 EP\")","v":"M40 EP"},{"$f":"IF(glas=2,taal!A69,IF(glas>3,taal!A69,IF(type=3,taal!A69,IF(OR(type=1,type=2),taal!A61,taal!A50&\" \"&taal!A54&IF(type<7,\" \"&taal!A49,\" \")))))","v":"heatstop PC opaal"},{"$f":"IF(K19=0,taal!A69,IF(glas=2,A83,taal!A69))","v":"maak andere keuze!"},1,"iWindow3",null,"45   45",45,45,45,45,45,45,30,130,"Ø",60,60,60,50,80,60,60,30,130,40,70,60,90,40,100,50,50,40,100,"50   50",50,50,75,75,2,2,2,2,"50   50",70,70,2,2,2,2,2,null,2,null,"45   45",45,45,65,65,2,2,2,2,75,75,null,null,null,null,null,null,null,null,2,2,2,2,2,2,2,2,null,null,500,17.5,10,6,null,null,null,null,null,{"$f":"(DA6&DB6)*1","v":4040},40,40,"pvc EP 25"]
["Polski","Vitria",{"$f":"IF(glas>3,\"*\",taal!A30)","v":"dubbelwandig"},null,null,null,{"$f":"IF(op=1,H7,IF(op=2,I7,IF(op=3,J7,K7)))","v":"maak andere keuze!"},{"$f":"taal!A69","v":"maak andere keuze!"},{"$f":"IF(F3=\"*\",\"*\",\"PO 50/20\")","v":"PO 50/20"},{"$f":"IF(F4=\"*\",\"*\",\"M50\")","v":"M50"},{"$f":"IF(F5=\"*\",\"*\",\"M50 EP\")","v":"M50 EP"},null,{"$f":"IF(K19=0,taal!A69,IF(glas=2,A84,taal!A69))","v":"maak andere keuze!"},0,null,null,"50   50",50,50,50,50,50,50,40,70,"Ø",70,70,70,50,110,70,70,"Ø",40,40,100,60,120,40,130,55,55,50,50,"55   55",55,55,80,80,2,2,2,2,"55   55",75,75,2,2,2,2,2,2,2,null,"50   50",50,50,70,70,2,2,2,2,80,80,2,2,2,2,2,2,2,2,2,2,2,2,2,2,2,2,null,null,550,17,12,8,null,null,null,null,null,{"$f":"(DA7&DB7)*1","v":4545},45,45,"pvc EP 25"]
["Czech",null,{"$f":"IF(glas>3,\"*\",taal!A31)","v":"enkelwandig"},null,null,null,"maak andere keuze!",{"$f":"taal!A69","v":"maak andere keuze!"},{"$f":"IF(F3=\"*\",\"*\",\"PO 30/00\")","v":"PO 30/00"},{"$f":"IF(F4=\"*\",\"*\",\"M60\")","v":"M60"},{"$f":"IF(F5=\"*\",\"*\",\"M60 EP\")","v":"M60 EP"},null,{"$f":"IF(glas=1,taal!A69,IF(AND(OR(glas=3,glas=6),op<5),A85,taal!A69))","v":"maak andere keuze!"},{"$f":"IF(K19=0,taal!A17,\"1 (+20 cm)\")","v":"1 (+20 cm)"},null,null,"55   55",55,55,55,55,55,55,40,100,"Ø",80,75,75,{"$f":"IF(kleur>2,\"\",60)","v":60},{"$f":"IF(kleur>2,\"\",90)","v":90},70,100,40,40,{"$f":"IF(OR(kleur=3,kleur=4),\"*\",40)","v":40},{"$f":"IF(OR(kleur=3,kleur=4),\"*\",140)","v":140},60,130,40,140,60,60,60,60,"60   60",60,60,85,85,2,2,2,2,"60   60",80,80,2,2,2,2,2,2,2,null,"55   55",55,55,75,75,2,2,2,2,85,85,2,2,2,2,null,null,null,null,2,2,2,2,2,2,2,2,null,null,600,17.5,12,8,null,null,null,null,null,5050,50,50,"pvc EP 25"]
["Latvian",null,{"$f":"taal!A69","v":"maak andere keuze!"},null,null,null,"maak andere keuze!",{"$f":"taal!A69","v":"maak andere keuze!"},{"$f":"IF(F3=\"*\",\"*\",\"PO 50/00\")","v":"PO 50/00"},{"$f":"IF(F4=\"*\",\"*\",\"M70\")","v":"M70"},{"$f":"IF(F5=\"*\",\"*\",\"M70 EP\")","v":"M70 EP"},null,{"$f":"IF(glas=1,taal!A69,IF(glas=3,A86,taal!A69))","v":"maak andere keuze!"},{"$f":"IF(K19=0,taal!A17,\"2 (+ 40 cm)\")","v":"2 (+ 40 cm)"},null,null,"60   60",60,60,60,60,60,60,40,130,"Ø",90,80,80,{"$f":"IF(kleur>2,\"\",60)","v":60},{"$f":"IF(kleur>2,\"\",120)","v":120},75,75,40,70,{"$f":"IF(OR(kleur=3,kleur=4),\"*\",\"Ø\")","v":"Ø"},{"$f":"IF(OR(kleur=3,kleur=4),\"*\",50)","v":50},{"$f":"IF(raam=5,taal!$A$69,60)","v":60},{"$f":"IF(raam=5,\"\",150)","v":150},40,160,60,90,60,80,"70   70",70,70,95,95,2,2,2,2,"70   70",90,90,2,2,2,2,2,2,2,null,"60   60",60,60,80,80,2,2,2,2,90,90,2,2,2,2,2,2,2,2,2,2,2,2,2,2,2,2,null,null,700,18.5,15,12,null,null,null,null,null,5555,55,55,"pvc EP 25"]
[null,null,null,null,null,null,"maak andere keuze!",{"$f":"taal!A69","v":"maak andere keuze!"},{"$f":"taal!A69","v":"maak andere keuze!"},{"$f":"IF(F4=\"*\",\"*\",\"M80\")","v":"M80"},{"$f":"IF(F5=\"*\",\"*\",\"M80 EP\")","v":"M80 EP"},null,{"$f":"IF(glas=1,taal!A69,IF(AND(glas=4,op<5),A87,taal!A69))","v":"maak andere keuze!"},{"$f":"IF(K19=0,taal!A17,\"3 (+ 60 cm)\")","v":"3 (+ 60 cm)"},null,null,"70   70",70,70,70,70,70,70,40,140,"Ø",100,90,90,70,100,80,80,40,100,50,50,{"$f":"IF(raam=5,taal!$A$69,60)","v":60},{"$f":"IF(raam=5,\"\",180)","v":180},40,190,70,70,60,90,"75   75",75,75,100,100,2,2,2,2,"80   80",100,100,2,2,2,2,2,2,2,null,"70   70",70,70,90,90,2,2,2,2,100,100,2,2,2,2,2,2,2,2,2,2,2,2,2,2,2,2,null,null,750,17.5,14,10,null,null,null,null,null,6060,60,60,"pvc EP 25"]
[null,null,null,null,null,null,"maak andere keuze!",{"$f":"taal!A69","v":"maak andere keuze!"},{"$f":"taal!A69","v":"maak andere keuze!"},{"$f":"IF(F4=\"*\",\"*\",\"M90\")","v":"M90"},{"$f":"IF(F5=\"*\",\"*\",\"M90 EP\")","v":"M90 EP"},null,{"$f":"IF(glas=1,taal!A69,IF(glas=4,A88,taal!A69))","v":"maak andere keuze!"},null,null,null,"75   75",75,75,75,75,75,75,40,160,"Ø",110,100,100,75,125,80,130,40,130,50,70,70,70,40,220,70,100,60,120,"80   80",80,80,105,105,2,2,2,2,"90   90",110,110,2,2,2,2,null,2,2,null,"75   75",75,75,95,95,2,2,2,2,105,105,2,2,2,2,2,2,2,2,2,2,2,2,2,2,2,2,null,null,800,19,14,10,null,null,null,null,null,7070,70,70,"pvc EP 25"]
[null,null,null,null,null,null,"maak andere keuze!",{"$f":"taal!A69","v":"maak andere keuze!"},{"$f":"taal!A69","v":"maak andere keuze!"},{"$f":"IF(F4=\"*\",\"*\",\"M100\")","v":"M100"},{"$f":"IF(F5=\"*\",\"*\",\"M100 EP\")","v":"M100 EP"},null,{"$f":"IF(glas=1,taal!A69,IF(AND(glas=5,op<5),A89,taal!A69))","v":"maak andere keuze!"},null,null,null,"80   80",80,80,80,80,80,80,40,190,"Ø",120,110,110,75,175,90,90,40,140,50,80,70,100,40,280,75,75,70,70,"90   90",90,90,115,115,2,2,2,2,"100   100",120,120,2,2,2,2,2,2,2,null,"80   80",80,80,100,100,2,2,2,2,110,110,2,2,2,2,2,2,2,2,2,2,2,2,2,2,2,2,null,null,850,19,14,10,null,null,null,null,null,7575,75,75,"pvc EP 25"]
[null,null,null,null,null,null,null,null,null,null,null,null,{"$f":"IF(glas=1,taal!A69,IF(glas=5,A90,taal!A69))","v":"maak andere keuze!"},null,null,null,"85   85",85,85,85,85,85,85,40,220,"Ø",130,120,120,80,110,100,100,40,160,50,110,70,130,45,105,80,80,70,100,"100   100",100,100,125,125,2,2,2,2,"105   105",125,125,2,2,2,2,2,null,null,null,"85   85",85,85,{"$f":"BO13+20","v":105},{"$f":"BP13+20","v":105},2,2,2,2,{"$f":"BO13+30","v":115},{"$f":"BP13+30","v":115},2,2,2,2,2,2,2,2,2,2,2,2,2,2,2,2,null,null,900,19,14,10,null,null,null,null,null,8080,80,80,"pvc EP 25"]
[null,null,null,null,null,null,null,null,null,null,null,null,{"$f":"IF(AND(glas=1,K19=0),A91,taal!A69)","v":"maak andere keuze!"},null,null,null,"90   90",90,90,{"$f":"IF(OR(type=1,type=2),AF14,IF(type=3,AJ14,IF(type=4,AH14,IF(AND(bol=1,vorm=3)=TRUE,Z14,IF(AND(bol=1,vorm=1)=TRUE,V14,IF(AND(bol=1,vorm=2)=TRUE,X14,IF(AND(bol=2,vorm=1)=TRUE,AB14,IF(AND(bol=2,vorm=2)=TRUE,AD14,\"\"))))))))","v":90},90,90,90,40,280,"Ø",140,130,130,80,130,100,130,40,190,55,55,{"$f":"IF(raam=5,taal!$A$69,70)","v":70},{"$f":"IF(raam=5,\"\",150)","v":150},50,50,80,130,70,130,"105   105",105,105,130,130,2,2,2,2,"120   120",140,140,2,2,2,2,2,2,2,null,"90   90",90,90,110,110,2,2,2,2,120,120,2,2,2,2,2,2,2,2,2,2,2,2,2,2,2,2,null,null,1000,22,15,12,null,null,null,null,null,{"$f":"(DA14&DB14)*1","v":8585},85,85,"pvc EP 25"]
[null,null,null,null,null,null,null,null,null,null,null,null,null,null,null,null,"100   100",100,100,100,100,100,100,45,75,"Ø",160,140,140,80,180,100,150,45,45,{"$f":"IF(OR(kleur=3,kleur=4),\"*\",\"Ø\")","v":"Ø"},{"$f":"IF(OR(kleur=3,kleur=4),\"*\",60)","v":60},75,75,50,70,80,180,75,75,"110   110",110,110,135,135,2,2,2,2,"130   130",150,150,2,2,2,2,2,2,2,null,"100   100",100,100,120,120,2,2,2,2,130,130,2,2,2,2,2,2,2,2,2,2,2,2,2,2,2,2,null,null,1050,21,14,10,null,null,null,null,null,9090,90,90,"pvc EP 25"]
[null,{"$f":"INDEX(B2:B12,glas)","v":"Skylux lichtkoepel"},{"$f":"INDEX(C2:C12,type)","v":"driewandig"},null,null,{"$f":"INDEX(F2:F12,op)","v":"pvc-opstand"},{"$f":"INDEX(G2:G12,prvc)","v":"pvc 20/00 EP"},null,null,null,null,{"$f":"INDEX(L2:L12,kleur)","v":"helder PMMA"},{"$f":"INDEX(M2:M14,raam)","v":"geen"},null,null,null,"105   105",105,105,105,105,105,105,45,105,"Ø",170,{"$f":"IF(kleur>2,\"\",150)","v":150},{"$f":"IF(kleur>2,\"\",150)","v":150},100,130,100,160,45,75,60,60,75,105,50,80,90,90,80,80,"120   120",120,120,145,145,2,2,2,2,"140   140",160,160,null,null,null,null,null,2,2,null,"105   105",105,105,125,125,2,2,2,2,135,135,2,2,2,2,2,2,2,2,2,2,2,2,2,2,2,2,null,null,1100,22,14,10,null,null,null,null,null,100100,100,100,"pvc EP 25"]
[null,{"$f":"IF(B16=taal!$A$69,0,1)","v":1},{"$f":"IF(C16=taal!$A$69,0,1)","v":1},null,null,{"$f":"IF(F16=taal!$A$69,0,1)","v":1},{"$f":"IF(G16=taal!$A$69,0,1)","v":1},null,null,null,null,{"$f":"IF(L16=taal!$A$61,0,1)","v":1},{"$f":"IF(OR(M16=taal!$A$69,AND(glas>=3,M16=taal!A17)),0,1)","v":1},null,{"$f":"C17*F17*G17*L17*M17","v":1},null,"110   110",110,110,110,110,110,110,50,70,"Ø",180,{"$f":"IF(kleur>2,\"\",160)","v":160},{"$f":"IF(kleur>2,\"\",160)","v":160},100,160,100,200,45,105,60,90,75,125,50,100,90,120,80,110,"130   130",130,130,155,155,2,2,2,2,"150   150",170,170,null,2,2,2,2,null,null,null,"110   110",110,110,130,130,2,2,2,2,140,140,2,2,2,2,2,2,2,2,2,2,2,2,2,2,2,2,null,null,1200,22.5,16,12,null,null,null,null,null,105105,105,105,"pvc EP 25"]
[null,null,null,null,null,null,null,null,null,null,null,null,null,null,null,null,"120   120",120,120,120,120,120,120,50,80,"Ø",200,{"$f":"IF(kleur>2,\"\",180)","v":180},{"$f":"IF(kleur>2,\"\",180)","v":180},100,200,100,220,"Ø",50,60,120,80,80,50,110,100,100,80,130,"140   140",140,140,165,165,2,2,2,2,"160   160",180,180,2,2,2,2,2,2,2,null,"120   120",120,120,140,140,2,2,2,2,150,150,2,2,2,2,2,2,2,2,2,2,2,2,2,2,2,2,null,null,1300,23,16,12,null,null,null,null,null,110110,110,110,"pvc EP 25"]
["Types of dome","U dome","U + IP32/89","U + EP25","iDome","iWindow2","iWindow3","Vitria",null,"daylight size",{"$f":"IF(R2='Skylux EP'!D5,0,R2*10)","v":1000},{"$f":"S2*10","v":1000},2,null,null,null,"130   130",130,130,130,130,130,130,50,100,null,null,{"$f":"IF(kleur>2,\"\",200)","v":200},{"$f":"IF(kleur>2,\"\",200)","v":200},100,220,105,105,50,50,{"$f":"IF(OR(kleur=3,kleur=4),\"*\",\"Ø\")","v":"Ø"},{"$f":"IF(OR(kleur=3,kleur=4),\"*\",70)","v":70},80,110,50,140,100,130,80,180,"150   150",150,150,175,175,2,2,2,2,"180   180",200,200,2,2,2,2,2,2,2,null,"130   130",130,130,150,150,2,2,2,2,160,160,2,2,2,2,2,2,2,2,2,2,2,2,2,2,2,2,null,null,1400,25.5,18,14,null,null,null,null,null,120120,120,120,"pvc EP 25"]
["EP10",1.3,{"$f":"IF(raam=6,0.3,IF(raam=5,0.55,0.6))","v":0.6},0.71,0.6,1,0.5,1.1000000000000001,null,"dome size",null,null,null,null,null,null,"140   140",140,140,140,140,140,140,50,110,null,null,null,null,110,170,110,110,50,70,70,70,{"$f":"IF(raam=5,taal!$A$69,80)","v":80},{"$f":"IF(raam=5,\"\",130)","v":130},50,170,100,150,80,200,"160   160",160,160,185,185,2,2,2,2,"200   200",220,220,2,2,2,2,2,2,null,null,"140   140",140,140,160,160,2,2,2,2,170,170,2,2,2,2,2,2,2,2,2,2,2,2,2,2,2,2,null,null,1500,25,18,14,null,null,null,null,null,130130,130,130,"pvc EP 25"]
["EP16",0.87,{"$f":"IF(raam=6,0.26,IF(raam=5,0.48,0.5))","v":0.5},0.56999999999999995,0.5,1,0.5,1.1000000000000001,null,null,null,null,null,null,null,null,"150   150",150,150,150,150,150,150,50,140,null,null,null,null,130,230,110,170,50,80,70,100,{"$f":"IF(raam=5,taal!$A$69,80)","v":80},{"$f":"IF(raam=5,\"\",140)","v":140},50,200,105,105,90,90,"180   180",180,180,205,205,2,2,2,2,"30   80",50,100,2,2,2,2,2,null,null,null,"150   150",150,150,170,170,2,2,2,2,180,180,2,2,2,2,2,2,2,2,2,2,2,2,2,2,2,2,null,null,1550,22.5,20,16,null,null,null,null,null,140140,140,140,"pvc EP 25"]
["5W",0.99,{"$f":"IF(raam=6,0.28,IF(raam=5,0.5,0.55))","v":0.55000000000000004},0.63,0.55000000000000004,1,0.5,1.1000000000000001,null,null,null,null,null,null,null,null,"155   155",155,155,155,155,155,155,50,170,null,null,null,null,null,null,120,120,50,100,70,130,90,90,50,230,110,110,90,120,"200   200",200,200,225,225,2,2,2,2,"30   130",50,150,2,2,2,2,2,null,null,null,"155   155",155,155,175,175,2,2,2,2,185,185,2,2,2,2,2,2,2,2,2,2,2,2,2,2,2,2,null,null,1600,25,20,16,null,null,null,null,null,150150,150,150,"pvc EP 25"]
["4W",1.28,{"$f":"IF(raam=6,0.3,IF(raam=5,0.56,0.61))","v":0.61},0.72,0.61,1,0.5,1.1000000000000001,null,null,null,null,null,null,null,null,"160   160",160,160,160,160,160,160,50,200,null,null,null,null,null,null,130,130,50,110,70,160,100,100,55,55,120,120,90,150,"30   80",30,80,55,105,2,2,null,null,"40   70",60,90,2,2,2,2,2,null,null,null,"160   160",160,160,180,180,2,2,2,2,190,190,2,2,2,2,2,2,2,2,2,2,2,2,2,2,2,2,null,null,1700,28,20,16,null,null,null,null,null,155155,155,155,"pvc EP 25"]
["3W",1.7,{"$f":"IF(raam=6,0.32,IF(raam=5,0.62,0.69))","v":0.69},0.83,0.69,1,0.5,1.1000000000000001,null,"thickness insulation",{"$f":"invoerblad!$D$12","v":5},null,null,null,null,null,"170   170",170,170,170,170,170,170,50,230,null,null,null,null,null,null,130,160,50,140,75,75,{"$f":"IF(raam=5,taal!$A$69,105)","v":105},{"$f":"IF(raam=5,\"\",105)","v":105},60,60,null,null,100,100,"30   130",30,130,55,155,2,2,null,null,"40   100",60,120,2,2,2,2,null,null,null,null,"170   170",170,170,190,190,2,2,2,2,200,200,2,2,2,2,2,2,2,2,2,2,2,2,2,2,2,2,null,null,1800,29.5,20,16,null,null,null,null,null,160160,160,160,"pvc EP 25"]
["2W",2.9,{"$f":"IF(raam=6,0.34,IF(raam=5,0.7,0.79))","v":0.79},0.98,0.79,1,0.5,1.1000000000000001,null,null,null,null,null,null,null,null,"180   180",180,180,180,180,180,180,60,80,{"$f":"taal!$A$62","v":"selecteer hoger"},null,{"$f":"taal!$A$62","v":"selecteer hoger"},null,{"$f":"taal!$A$62","v":"selecteer hoger"},null,130,220,50,170,75,105," "," ",60,80,null,null,100,130,"40   70",40,70,65,95,2,2,2,2,"60   90",80,110,null,null,null,null,null,2,2,null,"180   180",180,180,200,200,2,2,2,2,210,210,2,2,2,2,2,2,2,2,2,2,2,2,2,2,2,2,null,null,2000,30,23,18,null,null,null,null,null,170170,170,170,"pvc EP 25"]
["1W",5.17,{"$f":"IF(raam=6,0.36,IF(raam=5,0.81,0.93))","v":0.93},1.19,0.93,1,0.5,1.1000000000000001,null,null,null,null,null,null,null,null,"200   200",200,200,200,200,200,200,60,90,null,null,null,null,null,null,130,230,50,200,75,125,{"$f":"taal!$A$62","v":"selecteer hoger"},null,60,90,"selecteer hoger",null,100,150,"40   100",40,100,65,125,2,2,2,2,{"$f":"BD26-20&\"   \"&BE26-20","v":"60   130"},80,150,2,2,2,2,null,null,null,null,"200   200",200,200,220,220,2,2,null,null,230,230,2,2,2,2,2,2,2,2,2,2,2,2,2,2,2,2,null,null,null,null,null,null,null,null,null,null,null,180180,180,180,"pvc EP 25"]
["no dome","???",1,"???",1,1,0.5,1.1000000000000001,null,null,null,null,null,null,null,null,"   ","","",0,0,null,null,60,120,null,null,null,null,null,null,140,140,55,55,75,175," "," ",60,120," "," ",100,160,"40   190",40,190,65,215,2,2,2,2,{"$f":"BD27-20&\"   \"&BE27-20","v":"70   100"},90,120,2,2,2,2,2,2,2,null,"30   80",30,80,50,100,null,null,null,null,60,110,null,null,null,null,null,null,null,null,null,null,null,null,2,2,2,2,null,"Rectangle",300,11.5,9,5,{"$f":"VLOOKUP(K19,CQ27:CT42,2)","v":18},{"$f":"VLOOKUP(K19,CQ27:CT42,3)","v":14},{"$f":"VLOOKUP(K19,CQ27:CT42,4)","v":10},null,null,200200,200,200,"pvc EP 25"]
["Result dome:",{"$f":"INDEX(B20:B27,type)","v":1.7},0.69,0.83,0.69,1,0.5,1.1000000000000001,"= (Ut)",null,null,null,null,null,null,null,"   ","","",0,0,null,null,60,130,null,null,null,null,null,null,160,160,"Ø",60,{"$f":"IF(OR(kleur=3,kleur=4),\"*\",\"Ø\")","v":"Ø"},{"$f":"IF(OR(kleur=3,kleur=4),\"*\",80)","v":80}," "," ",60,130," "," ",100,200,"50   70",50,70,75,95,2,2,2,2,"80   130",100,150,2,2,2,2,2,2,2,null,"30   90",30,90,50,110,null,null,null,null,60,120,null,null,null,null,null,null,null,null,null,null,null,null,2,2,2,2,null,null,400,13.5,9,5]
[null,null,null,null,null,null,null,null,null,null,null,null,null,null,null,null,"   ","","",0,0,null,null,60,150,null,null,null,null,null,null,180,180,60,60,80,80," "," ",60,150," "," ",100,220,"50   80",50,80,75,105,2,2,2,2,"80   160",100,180,null,2,2,2,null,null,null,null,"30   130",30,130,50,150,null,null,null,null,60,160,null,null,null,null,null,null,null,null,null,null,null,null,2,2,2,2,null,null,450,13,10,6]
["Types of curb",null,null,null,null,null,null,null,null,null,null,null,null,null,null,null,"   ","","",0,0,null,null,60,180,null,null,null,null,null,null,null,null,60,80,80,110," "," ",60,180," "," ",110,110,"50   100",50,100,75,125,2,2,2,2,"80   180",100,200,2,2,2,2,2,null,null,null,"40   70",40,70,60,90,2,2,2,2,70,100,null,null,null,null,2,2,2,2,2,2,2,2,2,2,2,2,null,null,500,17,10,6]
["PVC","Uup","Pup","Pup (z daylight-1side)","eup","Aup",null,null,null,"free hight","inclination","roofopening C-B","isolatiehoogte",null,null,null,"   ","","",0,0,null,null,60,200,null,null,null,null,null,null,"selecteer hoger",null,60,90,80,130," "," ",60,200," "," ",120,120,"60   90",60,90,85,115,2,2,2,2,"80   220",100,240,2,2,2,2,2,null,null,null,"40   100",40,100,60,120,2,2,2,2,70,130,null,null,null,null,2,2,2,2,2,2,2,2,2,2,2,2,null,null,600,17,12,8,null,null,null,null,null,{"$f":"(DA31&DB31)*1","v":4070},40,70,"pvc EP 25"]
["20/00 EP",{"$f":"0.61","v":0.61},{"$f":"IF(vorm<3,((($K$19+$L$19)*2/1000)+8*$D32),($L$19+2*$D32)/1000*3.14)","v":4.47248},5.9060000000000001E-2,0.1857,{"$f":"C32*E32*(J32/E32)","v":0.60691553599999981},null,null,null,{"$f":"E32-($K$24/100)","v":0.13569999999999999},90,0,5,null,null,null,"   ","","",0,0,null,null,70,100,null,null,null,null,null,null,null,null,60,120,80,180," "," ",70,70," "," ",130,130,"60   120",60,120,85,145,2,2,2,2,"80   230",100,250,2,2,2,2,2,null,null,null,"40   130",40,130,60,150,2,2,2,2,70,160,null,null,null,null,2,2,2,2,2,2,2,2,2,2,2,2,null,null,700,18,15,12,null,null,null,null,null,{"$f":"(DA32&DB32)*1","v":40100},40,100,"pvc EP 25"]
["16/20 EP",{"$f":"0.89","v":0.89},{"$f":"IF(vorm<3,((($K$19+$L$19)*2/1000)+8*$D33),($L$19+2*$D33)/1000*3.14)","v":4.7796000000000003},9.7449999999999995E-2,0.14299999999999999,{"$f":"C33*E33*(J33/E33)","v":0.44450279999999992},null,null,null,{"$f":"E33-($K$24/100)","v":9.2999999999999985E-2},45,20,0,null,null,null,"   ","","",0,0,null,null,70,130,null,null,null,null,null,null,null,null,60,130,{"$f":"IF(OR(kleur=3,kleur=4),\"*\",85)","v":85},{"$f":"IF(OR(kleur=3,kleur=4),\"*\",85)","v":85}," "," ",70,100," "," ",140,140,"60   130",60,130,85,155,2,2,2,2,"80   280",100,300,2,2,2,2,2,null,null,null,{"$f":"BO33&\"   \"&BP33","v":"40   140"},40,140,{"$f":"BO33+20","v":60},{"$f":"BP33+20","v":160},2,2,2,2,70,170,null,null,null,null,2,2,2,2,2,2,2,2,2,2,2,2,null,null,750,19,14,10,null,null,null,null,null,40130,40,130,"pvc EP 25"]
["16/00",{"$f":"1","v":1},{"$f":"IF(vorm<3,((($K$19+$L$19)*2/1000)+8*$D34),($L$19+2*$D34)/1000*3.14)","v":4.3496800000000002},4.3709999999999999E-2,0.13800000000000001,0.38277184000000009,null,null,null,{"$f":"E34-($K$24/100)","v":8.8000000000000009E-2},90,0,0,null,null,null,"   ","","",0,0,null,null,70,150,null,null,null,null,null,null,null,null,60,150,{"$f":"IF(OR(kleur=3,kleur=4),\"*\",\"Ø\")","v":"Ø"},{"$f":"IF(OR(kleur=3,kleur=4),\"*\",90)","v":90}," "," ",70,130," "," ",150,150,"70   100",70,100,95,125,2,2,2,2,"100   130",120,150,2,2,2,2,2,2,2,null,{"$f":"BO34&\"   \"&BP34","v":"40   160"},40,160,{"$f":"BO34+20","v":60},{"$f":"BP34+20","v":180},2,2,2,2,70,190,null,null,null,null,2,2,2,2,2,2,2,2,2,2,2,2,null,null,800,17.5,14,10,null,null,null,null,null,40160,40,160,"pvc EP 25"]
["30/20",{"$f":"1","v":1},{"$f":"IF(vorm<3,((($K$19+$L$19)*2/1000)+8*$D35),($L$19+2*$D35)/1000*3.14)","v":4.5887200000000004},7.3590000000000003E-2,0.28000000000000003,1.0554056000000003,null,null,null,{"$f":"E35-($K$24/100)","v":0.23000000000000004},58,20,15,null,null,null,"selecteer hoger    ","selecteer hoger"," ","selecteer hoger"," ",{"$f":"taal!$A$62","v":"selecteer hoger"}," ",70,160,{"$f":"taal!$A$62","v":"selecteer hoger"},null,{"$f":"taal!$A$62","v":"selecteer hoger"},null,{"$f":"taal!$A$62","v":"selecteer hoger"},null,{"$f":"taal!$A$62","v":"selecteer hoger"},null,60,180,90,90,{"$f":"taal!$A$62","v":"selecteer hoger"}," ",70,150,{"$f":"taal!$A$62","v":"selecteer hoger"},null,{"$f":"taal!$A$62","v":"selecteer hoger"},null,"70   130",70,130,95,155,2,2,2,2,"100   150",120,170,null,null,null,null,null,null,2,null,"40   190",40,190,60,210,2,2,2,2,70,220,null,null,null,null,2,2,2,2,2,2,2,2,2,2,2,2,null,null,900,19.5,14,10,null,null,null,null,null,40190,40,190,"pvc EP 25"]
["35/30",{"$f":"0.86","v":0.86},{"$f":"IF(vorm<3,((($K$19+$L$19)*2/1000)+8*$D36),($L$19+2*$D36)/1000*3.14)","v":5.2736000000000001},0.15920000000000001,0.33900000000000002,1.5240704000000003,null,null,null,{"$f":"E36-($K$24/100)","v":0.28900000000000003},90,30,20,null,null,null,"   ",{"$f":"IF(glas=6,AR36,IF(glas=5,AP36,IF(glas>2,AN36,IF(glas>1,AL36,IF(T36=0,\"\",T36)))))","v":""},{"$f":"IF(glas=6,AS36,IF(glas=5,AQ36,IF(glas>2,AO36,IF(glas>1,AM36,IF(U36=0,\"\",U36)))))","v":""},{"$f":"IF(OR(type=1,type=2),AF36,IF(type=3,AJ36,IF(type=4,AH36,IF(AND(bol=1,vorm=3)=TRUE,Z36,IF(AND(bol=1,vorm=1)=TRUE,V36,IF(AND(bol=1,vorm=2)=TRUE,X36,IF(AND(bol=2,vorm=1)=TRUE,AB36,IF(AND(bol=2,vorm=2)=TRUE,AD36,\"\"))))))))","v":0},{"$f":"IF(OR(type=1,type=2),AG36,IF(type=3,AK36,IF(type=4,AI36,IF(AND(bol=1,vorm=3)=TRUE,AA36,IF(AND(bol=1,vorm=1)=TRUE,W36,IF(AND(bol=1,vorm=2)=TRUE,Y36,IF(AND(bol=2,vorm=1)=TRUE,AC36,IF(AND(bol=2,vorm=2)=TRUE,AE36,\"\"))))))))","v":0},null,null,70,200,null,null,null,null,null,null,null,null,60,200,90,120," "," ",70,160," "," ",null,null,"75   125",75,125,100,150,2,2,2,2,"100   160",120,180,2,2,2,2,2,null,2,null,"40   220",40,220,60,240,2,2,2,2,70,250,null,null,null,null,2,2,2,2,2,2,2,2,2,2,2,2,null,null,1000,18,14,10,null,null,null,null,null,40220,40,220,"pvc EP 25"]
[null,null,null,null,null,null,"Rond Aup","Rond Pup",null,null,null,null,null,null,null,null,"   ","","",0,0,null,null,70,220,null,null,null,null,null,null,null,null,"Ø",70,90,150," "," ",70,200," "," ",null,null,"75   175",75,175,100,200,2,2,2,2,"100   190",120,210,null,2,2,2,0,null,null,null,"40   280",40,280,60,300,2,2,2,2,{"$f":"BO37+30","v":70},{"$f":"BP37+30","v":310},null,null,null,null,2,2,2,2,2,2,2,2,2,2,2,2,null,null,1050,18,14,10,null,null,null,null,null,40280,40,280,"pvc EP 25"]
["H15/25",{"$f":"1.32","v":1.32},{"$f":"IF(vorm<3,((($K$19+$L$19)*2/1000)+8*$D38),($L$19+2*$D38)/1000*3.14)","v":4.5452000000000004},6.8150000000000002E-2,0.13869999999999999,{"$f":"C38*E38*(J38/E38)","v":0.40315923999999997},{"$f":"H38*E38*(J38/E38)","v":0.31648000339999999},{"$f":"(($L$19/1000)+2*$D38)*3.14","v":3.5679820000000002},null,{"$f":"E38-($K$24/100)","v":8.8699999999999987E-2},41,25,0,null,null,null,"   ","","",0,0,null,null,75,105,null,null,null,null,null,null,null,null,70,70,{"$f":"IF(OR(kleur=3,kleur=4),\"*\",\"Ø\")","v":"Ø"},{"$f":"IF(OR(kleur=3,kleur=4),\"*\",100)","v":100}," "," ",70,220," "," ",null,null,"75   225",75,225,100,250,2,2,2,2,"100   200",120,220,2,2,2,2,2,2,2,null,"45   75",45,75,65,95,2,2,2,2,75,105,null,null,null,null,null,null,null,null,2,2,2,2,2,2,2,2,null,null,1100,18,14,10,null,null,null,null,null,4575,45,75,"pvc EP 25"]
["D15/20",{"$f":"0.8","v":0.8},4.4972000000000003,6.2149999999999997E-2,0.14099999999999999,{"$f":"C39*E39*(J39/E39)","v":0.40924519999999998},{"$f":"H39*E39*(J39/E39)","v":0.32125748199999993},3.5303020000000003,null,9.0999999999999984E-2,48,20,0,null,null,null,"   ","","",0,0,null,null,75,125,null,null,null,null,null,null,null,null,70,100,100,100," "," ",75,75," "," ",null,null,"80   130",80,130,105,155,2,2,2,2,"100   220",120,240,2,2,2,2,2,2,null,null,"45   105",45,105,65,125,2,2,2,2,75,135,null,null,null,null,null,null,null,null,2,2,2,2,2,2,2,2,null,null,1200,18,16,12,null,null,null,null,null,45105,45,105,"pvc EP 25"]
["D30/20",{"$f":"0.8","v":0.8},4.5614400000000002,7.0180000000000006E-2,0.29099999999999998,1.0993070400000002,0.86295602640000002,3.5807304000000002,null,0.24099999999999999,70,20,15,null,null,null,"   ","","",0,0,null,null,75,165,null,null,null,null,null,null,null,null,70,130,100,130," "," ",75,105," "," ",null,null,"80   180",80,180,105,205,2,2,2,2,"100   230",120,250,2,2,2,2,2,null,null,null,"50   70",50,70,70,90,2,2,2,2,80,100,2,2,2,2,2,2,2,2,2,2,2,2,2,2,2,2,null,null,1300,27.5,16,12,null,null,null,null,null,5070,50,70,"pvc EP 25"]
["D30/20 EP60",{"$f":"0.35","v":0.35},4.8272000000000004,0.10340000000000001,0.29070000000000001,1.1619070400000002,0.91209702640000034,3.7893520000000005,null,0.24070000000000003,69,20,15,null,null,null,"   ","","",0,0,null,null,75,175,null,null,null,null,null,null,null,null,70,150,100,150," "," ",75,125," "," ",null,null,"80   220",80,220,105,245,2,2,2,2,"100   250",120,270,2,2,2,2,2,2,null,null,"50   80",50,80,70,100,2,2,2,2,80,110,2,2,2,2,2,2,2,2,2,2,2,2,2,2,2,2,null,null,1450,20,18,14,null,null,null,null,null,5080,50,80,"pvc EP 25"]
["D30/20 EP100",{"$f":"0.23","v":0.23},5.1096000000000004,0.13869999999999999,0.29110000000000003,1.2319245600000004,0.96706077960000036,4.0110360000000007,null,0.24110000000000004,69,20,15,null,null,null,"   ","","",0,0,null,null,75,225,null,null,null,null,null,null,null,null,70,160,100,160," "," ",75,165," "," ",null,null,"80   230",80,230,105,255,2,2,2,2,"120   210",140,230,2,0,null,null,0,null,null,null,"50   100",50,100,70,120,2,2,2,2,80,130,2,2,2,2,2,2,2,2,2,2,2,2,2,2,2,2,null,null,1600,21,20,16,null,null,null,null,null,50100,50,100,"pvc EP 25"]
["D50/20",{"$f":"0.8","v":0.8},4.5878399999999999,7.3480000000000004E-2,0.49099999999999999,2.0232374399999999,1.5882413904000001,3.6014544000000002,null,0.441,78,20,35,null,null,null,"   ","","",0,0,null,null,80,110,null,null,null,null,null,null,null,null,70,200,{"$f":"IF(OR(kleur=3,kleur=4),\"*\",100)","v":100},{"$f":"IF(OR(kleur=3,kleur=4),\"*\",180)","v":180}," "," ",75,175," "," ",null,null,"80   280",80,280,105,305,2,2,2,2,"130   160",150,180,2,2,2,2,2,null,2,null,"50   110",50,110,70,130,2,2,2,2,80,140,2,2,2,2,2,2,2,2,2,2,2,2,2,2,2,2,null,null,null,null,null,null,null,null,null,null,null,50110,50,110,"pvc EP 25"]
["D30/00",{"$f":"0.8","v":0.8},4.2080000000000002,2.5999999999999999E-2,0.29249999999999998,1.02044,0.80104540000000013,3.3032800000000004,null,0.24249999999999999,90,0,15,null,null,null,"   ","","",0,0,null,null,80,130,null,null,null,null,null,null,null,null,70,220,100,200," "," ",75,225," "," ",null,null,"90   120",90,120,115,145,2,2,2,2,"130   190",150,210,2,2,2,2,2,null,2,null,"50   140",50,140,70,160,2,2,2,2,80,170,2,2,2,2,2,2,2,2,2,2,2,2,2,2,2,2,null,"Round",400,13,9,5,{"$f":"VLOOKUP((L19),CQ44:CT58,2)","v":17.5},{"$f":"VLOOKUP((L19),CQ44:CT58,3)","v":14},{"$f":"VLOOKUP((L19),CQ44:CT58,4)","v":10},null,null,50140,50,140,"pvc EP 25"]
["D50/00",{"$f":"0.8","v":0.8},4.2080000000000002,2.5999999999999999E-2,0.49249999999999999,1.8620400000000004,1.4617014000000004,3.3032800000000004,null,0.4425,90,0,35,null,null,null,"selecteer hoger    ","selecteer hoger"," ","selecteer hoger"," ",{"$f":"taal!$A$62","v":"selecteer hoger"}," ",80,140,{"$f":"taal!$A$62","v":"selecteer hoger"},null,{"$f":"taal!$A$62","v":"selecteer hoger"},null,{"$f":"taal!$A$62","v":"selecteer hoger"},null,{"$f":"taal!$A$62","v":"selecteer hoger"},null,75,75,{"$f":"IF(OR(kleur=3,kleur=4),\"*\",100)","v":100},{"$f":"IF(OR(kleur=3,kleur=4),\"*\",220)","v":220},{"$f":"taal!$A$62","v":"selecteer hoger"}," ",80,80,{"$f":"taal!$A$62","v":"selecteer hoger"},null,{"$f":"taal!$A$62","v":"selecteer hoger"},null,"90   150",90,150,115,175,2,2,2,2,"130   220",150,240,2,2,2,2,2,2,null,null,"50   170",50,170,70,190,2,2,2,2,80,200,2,2,2,2,2,2,2,2,2,2,2,2,2,2,2,2,null,null,500,13.5,10,6,null,null,null,null,null,50170,50,170,"pvc EP 25"]
[null,null,null,null,null,null,null,null,null,null,null,null,null,null,null,null,"   ","","",0,0,null,null,80,160,null,null,null,null,null,null,null,null,75,105,105,105," "," ",80,110," "," ",null,null,"90   180",90,180,115,205,2,2,2,2,"130   230",150,250,2,2,2,2,2,null,null,null,"50   200",50,200,70,220,2,2,2,2,80,230,2,2,2,2,2,2,2,2,2,2,2,2,2,2,2,2,null,null,600,14.5,12,8,null,null,null,null,null,50200,50,200,"pvc EP 25"]
[15,{"$f":"0.84","v":0.84},{"$f":"IF(vorm<3,((($K$19+$L$19)*2/1000)+8*$D47),($L$19+2*$D47)/1000*3.14)","v":4.3319999999999999},4.1500000000000002E-2,{"$f":"$E$50-(($A$50-$A47)/100)","v":0.14699999999999999},{"$f":"C47*E47*(J47/E47)","v":0.42020399999999991},{"$f":"H47*E47*(J47/E47)","v":0.32986013999999997},{"$f":"(($L$19/1000)+2*$D47)*3.14","v":3.40062},null,{"$f":"E47-($K$24/100)","v":9.6999999999999989E-2},90,0,0,null,null,null,"   ","","",0,0,null,null,80,170,null,null,null,null,null,null,null,null,75,125,{"$f":"IF(OR(kleur=3,kleur=4),\"*\",\"Ø\")","v":"Ø"},{"$f":"IF(OR(kleur=3,kleur=4),\"*\",110)","v":110}," "," ",80,130," "," ",null,null,"100   130",100,130,125,155,2,2,2,2,"130   250",150,270,2,2,2,2,null,null,null,null,"50   230",50,230,70,250,2,2,2,2,80,260,2,2,2,2,2,2,2,2,2,2,2,2,2,2,2,2,null,null,700,16.5,14,10,null,null,null,null,null,50230,50,230,"pvc EP 25"]
[20,0.84,4.3319999999999999,4.1500000000000002E-2,{"$f":"$E$50-(($A$50-$A48)/100)","v":0.19699999999999998},0.63680399999999993,0.4998911399999999,3.40062,null,0.14699999999999996,90,0,5,null,null,null,"   ","","",0,0,null,null,80,180,null,null,null,null,null,null,null,null,75,165,{"$f":"IF(OR(kleur=3,kleur=4),\"*\",110)","v":110},{"$f":"IF(OR(kleur=3,kleur=4),\"*\",110)","v":110}," "," ",80,140," "," ",null,null,"100   150",100,150,125,175,2,2,2,2,"130   280",150,300,2,2,2,2,0,2,2,null,"60   80",60,80,80,100,2,2,2,2,90,110,2,2,2,2,2,2,2,2,2,2,2,2,2,2,2,2,null,null,800,16.5,14,10,null,null,null,null,null,6080,60,80,"pvc EP 25"]
[25,0.84,4.3319999999999999,4.1500000000000002E-2,{"$f":"$E$50-(($A$50-$A49)/100)","v":0.247},0.85340400000000005,0.66992214000000005,3.40062,null,0.19700000000000001,90,0,10,null,null,null,"   ","","",0,0,null,null,80,200,null,null,null,null,null,null,null,null,75,175,{"$f":"IF(OR(kleur=3,kleur=4),\"*\",110)","v":110},{"$f":"IF(OR(kleur=3,kleur=4),\"*\",170)","v":170}," "," ",80,160," "," ",null,null,"100   160",100,160,125,185,2,2,2,2,"160   220",180,240,2,2,2,2,2,null,null,null,"60   90",60,90,80,110,2,2,2,2,90,120,2,2,2,2,2,2,2,2,2,2,2,2,2,2,2,2,null,null,900,16.5,14,10,null,null,null,null,null,6090,60,90,"pvc EP 25"]
[30,0.84,4.3319999999999999,4.1500000000000002E-2,0.29699999999999999,1.070004,0.83995313999999999,3.40062,null,0.247,90,0,15,null,null,null,"   ","","",0,0,null,null,80,220,null,null,null,null,null,null,null,null,75,225,{"$f":"IF(OR(kleur=3,kleur=4),\"*\",\"Ø\")","v":"Ø"},{"$f":"IF(OR(kleur=3,kleur=4),\"*\",120)","v":120}," "," ",80,170," "," ",null,null,"100   190",100,190,125,215,2,2,2,2,"160   230",180,250,2,2,2,2,0,null,null,null,"60   120",60,120,80,140,2,2,2,2,90,150,2,2,2,2,2,2,2,2,2,2,2,2,2,2,2,2,null,null,1000,17.5,14,10,null,null,null,null,null,60120,60,120,"pvc EP 25"]
[40,0.84,4.3319999999999999,4.1500000000000002E-2,{"$f":"$E$50+(($A51-$A$50)/100)","v":0.39700000000000002},1.5032040000000002,1.1800151400000001,3.40062,null,0.34700000000000003,90,0,25,null,null,null,"   ","","",0,0,null,null,80,230,null,null,null,null,null,null,null,null,"Ø",80,{"$f":"IF(OR(kleur=3,kleur=4),\"*\",120)","v":120},{"$f":"IF(OR(kleur=3,kleur=4),\"*\",120)","v":120}," "," ",80,180," "," ",null,null,"100   200",100,200,125,225,2,2,2,2,"160   250",180,270,2,2,2,2,2,2,null,null,"60   130",60,130,80,150,2,2,2,2,90,160,2,2,2,2,2,2,2,2,2,2,2,2,2,2,2,2,null,null,1100,17.5,14,10,null,null,null,null,null,60130,60,130,"pvc EP 25"]
[50,0.84,4.3319999999999999,4.1500000000000002E-2,0.497,1.9364039999999998,1.5200771399999999,3.40062,null,0.44700000000000001,90,0,35,null,null,null,"   ","","",0,0,null,null,80,250,null,null,null,null,null,null,null,null,80,80,{"$f":"IF(OR(kleur=3,kleur=4),\"*\",120)","v":120},{"$f":"IF(OR(kleur=3,kleur=4),\"*\",240)","v":240}," "," ",80,200," "," ",null,null,"100   220",100,220,125,245,2,2,2,2,"160   280",180,300,null,2,2,2,2,null,2,null,"60   150",60,150,80,170,2,2,2,2,90,180,2,2,2,2,2,2,2,2,2,2,2,2,2,2,2,2,null,null,1200,17.5,16,12,null,null,null,null,null,60150,60,150,"pvc EP 25"]
[60,0.84,4.3319999999999999,4.1500000000000002E-2,0.59699999999999998,2.3696039999999998,1.8601391399999998,3.40062,null,0.54699999999999993,90,0,45,null,null,null,"   ","","",0,0,null,null,80,280,null,null,null,null,null,null,null,null,80,110,{"$f":"IF(OR(kleur=3,kleur=4),\"*\",\"Ø\")","v":"Ø"},{"$f":"IF(OR(kleur=3,kleur=4),\"*\",130)","v":130}," "," ",80,220," "," ",null,null,"100   250",100,250,125,275,2,2,2,2,{"$f":"BD53&\"   \"&BE53-20","v":"Ø   40"},"Ø",60,2,2,null,null,2,2,2,null,"60   180",60,180,80,200,2,2,2,2,90,210,2,2,2,2,2,2,2,2,2,2,2,2,2,2,2,2,null,null,1300,20.5,16,12,null,null,null,null,null,60180,60,180,"pvc EP 25"]
[70,0.84,4.3319999999999999,4.1500000000000002E-2,0.69700000000000006,2.8028040000000001,2.2002011399999999,3.40062,null,0.64700000000000002,90,0,55,null,null,null,"   ","","",0,0,null,null,90,120,null,null,null,null,null,null,null,null,80,130,{"$f":"IF(OR(kleur=3,kleur=4),\"*\",130)","v":130},{"$f":"IF(OR(kleur=3,kleur=4),\"*\",130)","v":130}," "," ",80,230," "," ",null,null,"120   150",120,150,145,175,2,2,2,2,"Ø   50","Ø",70,2,2,null,null,2,2,2,null,"60   200",60,200,80,220,2,2,2,2,90,230,2,2,2,2,2,2,2,2,2,2,2,2,2,2,2,2,null,null,1400,20.5,18,14,null,null,null,null,null,60200,60,200,"pvc EP 25"]
[80,0.84,4.3319999999999999,4.1500000000000002E-2,0.79699999999999993,3.2360039999999994,2.5402631399999995,3.40062,null,0.74699999999999989,90,0,65,null,null,null,"selecteer hoger    ","selecteer hoger"," ","selecteer hoger"," ",{"$f":"taal!$A$62","v":"selecteer hoger"}," ",90,150,{"$f":"taal!$A$62","v":"selecteer hoger"},null,{"$f":"taal!$A$62","v":"selecteer hoger"},null,{"$f":"taal!$A$62","v":"selecteer hoger"},null,{"$f":"taal!$A$62","v":"selecteer hoger"},null,80,140,{"$f":"IF(OR(kleur=3,kleur=4),taal!$A$62,130)","v":130},{"$f":"IF(OR(kleur=3,kleur=4),\"*\",160)","v":160},{"$f":"taal!$A$62","v":"selecteer hoger"}," ",80,250,{"$f":"taal!$A$62","v":"selecteer hoger"},null,{"$f":"taal!$A$62","v":"selecteer hoger"},null,"120   180",120,180,145,205,2,2,2,2,"Ø   60","Ø",80,2,2,null,null,2,2,2,null,"70   100",70,100,90,120,2,2,2,2,100,130,2,2,2,2,2,2,2,2,2,2,2,2,2,2,2,2,null,null,1600,23.5,20,16,null,null,null,null,null,70100,70,100,"pvc EP 25"]
[90,0.84,4.3319999999999999,4.1500000000000002E-2,0.89700000000000002,3.6692039999999997,2.8803251400000001,3.40062,null,0.84699999999999998,90,0,75,null,null,null,"   ","","",0,0,null,null,90,180,null,null,null,null,null,null,null,null,80,"*",{"$f":"IF(OR(kleur=3,kleur=4),\"*\",130)","v":130},{"$f":"IF(OR(kleur=3,kleur=4),\"*\",220)","v":220}," "," ",80,280," "," ",null,null,"120   210",120,210,145,235,2,2,2,2,"Ø   70","Ø",90,2,2,null,null,2,2,2,null,"70   130",70,130,90,150,2,2,2,2,100,160,2,2,2,2,2,2,2,2,2,2,2,2,2,2,2,2,null,null,1700,23.5,20,16,null,null,null,null,null,70130,70,130,"pvc EP 25"]
[100,0.84,4.3319999999999999,4.1500000000000002E-2,0.99699999999999989,4.1024039999999991,3.2203871399999993,3.40062,null,0.94699999999999984,90,0,85,null,null,null,"   ","","",0,0,null,null,90,210,null,null,null,null,null,null,null,null,80,170,{"$f":"IF(OR(kleur=3,kleur=4),\"*\",130)","v":130},{"$f":"IF(OR(kleur=3,kleur=4),\"*\",230)","v":230}," "," ",85,85," "," ",null,null,"130   160",130,160,155,185,2,2,2,2,"Ø   80","Ø",100,2,2,null,null,2,2,2,null,"70   150",70,150,90,170,2,2,2,2,100,180,2,2,2,2,2,2,2,2,2,2,2,2,2,2,2,2,null,null,1800,21.5,20,16,null,null,null,null,null,70150,70,150,"pvc EP 25"]
[null,null,null,null,null,null,null,null,null,null,null,null,null,null,null,null,"   ","","",0,0,null,null,100,130,null,null,null,null,null,null,null,null,80,180,{"$f":"IF(OR(kleur=3,kleur=4),\"*\",130)","v":130},{"$f":"IF(OR(kleur=3,kleur=4),\"*\",250)","v":250}," "," ",90,90," "," ",null,null,"130   190",130,190,155,215,2,2,2,2,"Ø   90","Ø",110,2,2,null,null,2,null,2,null,"70   160",70,160,90,180,2,2,2,2,100,190,2,2,2,2,2,2,2,2,2,2,2,2,2,2,2,2,null,null,2000,21.5,23,18,null,null,null,null,null,70160,70,160,"pvc EP 25"]
[15,{"$f":"0.51","v":0.51},{"$f":"IF(vorm<3,((($K$19+$L$19)*2/1000)+8*$D59),($L$19+2*$D59)/1000*3.14)","v":4.4119999999999999},5.1499999999999997E-2,{"$f":"$E$62-(($A$62-$A59)/100)","v":0.14699999999999999},{"$f":"C59*E59*(J59/E59)","v":0.4279639999999999},{"$f":"H59*E59*(J59/E59)","v":0.33595174},{"$f":"(($L$19/1000)+2*$D59)*3.14","v":3.4634200000000002},null,{"$f":"E59-($K$24/100)","v":9.6999999999999989E-2},90,0,0,null,null,null,"   ","","",0,0,null,null,100,150,null,null,null,null,null,null,null,null,80,200,{"$f":"IF(OR(kleur=3,kleur=4),\"*\",130)","v":130},{"$f":"IF(OR(kleur=3,kleur=4),\"*\",280)","v":280}," "," ",90,120," "," ",null,null,"130   200",130,200,155,225,2,2,2,2,"Ø   100","Ø",120,2,2,null,null,2,2,2,null,"70   200",70,200,90,220,2,2,2,2,100,230,2,2,2,2,2,2,2,2,2,2,2,2,2,2,2,2,null,null,null,null,null,null,null,null,null,null,null,70200,70,200,"pvc EP 25"]
[20,0.51,4.4119999999999999,5.1499999999999997E-2,{"$f":"$E$62-(($A$62-$A60)/100)","v":0.19699999999999998},0.64856399999999992,0.50912273999999991,3.4634200000000002,null,0.14699999999999996,90,0,5,null,null,null,"   ","","",0,0,null,null,100,160,null,null,null,null,null,null,null,null,80,220,{"$f":"IF(OR(kleur=3,kleur=4),\"*\",\"Ø\")","v":"Ø"},{"$f":"IF(OR(kleur=3,kleur=4),\"*\",140)","v":140}," "," ",90,150," "," ",null,null,"130   220",130,220,155,245,2,2,2,2,"Ø   110","Ø",130,null,2,null,null,2,null,2,null,"70   220",70,220,90,240,2,2,2,2,100,250,2,2,2,2,2,2,2,2,2,2,2,2,2,2,2,2,null,null,null,null,null,null,null,null,null,null,null,70220,70,220,"pvc EP 25"]
[25,0.51,4.4119999999999999,5.1499999999999997E-2,{"$f":"$E$62-(($A$62-$A61)/100)","v":0.247},0.86916400000000005,0.68229374000000009,3.4634200000000002,null,0.19700000000000001,90,0,10,null,null,null,"   ","","",0,0,null,null,100,180,null,null,null,null,null,null,null,null,80,230,{"$f":"IF(OR(kleur=3,kleur=4),\"*\",140)","v":140},{"$f":"IF(OR(kleur=3,kleur=4),\"*\",140)","v":140}," "," ",90,180," "," ",null,null,"130   230",130,230,155,255,2,2,2,2,"Ø   120","Ø",140,2,2,null,null,2,2,2,null,"75   105",75,105,95,125,2,2,2,2,105,135,2,2,2,2,2,2,2,2,2,2,2,2,2,2,2,2,null,null,null,null,null,null,null,null,null,null,null,75105,75,105,"pvc EP 25"]
[30,0.51,4.4119999999999999,5.1499999999999997E-2,0.29699999999999999,1.089764,0.85546473999999995,3.4634200000000002,null,0.247,90,0,15,null,null,null,"   ","","",0,0,null,null,100,190,null,null,null,null,null,null,null,null,85,85,{"$f":"IF(OR(kleur=3,kleur=4),\"*\",150)","v":150},{"$f":"IF(OR(kleur=3,kleur=4),\"*\",150)","v":150}," "," ",90,210," "," ",null,null,"130   250",130,250,155,275,2,2,2,2,"Ø   130","Ø",150,2,2,null,null,2,2,2,null,"75   125",75,125,95,145,2,2,2,2,105,155,2,2,2,2,2,2,2,2,2,2,2,2,2,2,2,2,null,null,null,null,null,null,null,null,null,null,null,75125,75,125,"pvc EP 25"]
[40,0.51,4.4119999999999999,5.1499999999999997E-2,{"$f":"$E$62+(($A63-$A$62)/100)","v":0.39700000000000002},1.5309640000000002,1.2018067400000001,3.4634200000000002,null,0.34700000000000003,90,0,25,null,null,null,"   ","","",0,0,null,null,100,200,null,null,null,null,null,null,null,null,"Ø",90,{"$f":"IF(OR(kleur=3,kleur=4),\"*\",\"Ø\")","v":"Ø"},{"$f":"IF(OR(kleur=3,kleur=4),\"*\",160)","v":160}," "," ",100,100," "," ",null,null,"130   280",130,280,155,305,2,2,2,2,"Ø   140","Ø",160,null,2,null,null,null,2,2,null,"75   165",75,165,95,185,2,2,2,2,105,195,2,2,2,2,2,2,2,2,2,2,2,2,2,2,2,2,null,null,null,null,null,null,null,null,null,null,null,75165,75,165,"pvc EP 25"]
[50,0.51,4.4119999999999999,5.1499999999999997E-2,0.497,1.972164,1.54814874,3.4634200000000002,null,0.44700000000000001,90,0,35,null,null,null,"   ","","",0,0,null,null,100,220,null,null,null,null,null,null,null,null,90,90,{"$f":"IF(OR(kleur=3,kleur=4),\"*\",160)","v":160},{"$f":"IF(OR(kleur=3,kleur=4),\"*\",160)","v":160}," "," ",100,130," "," ",null,null,"145   170",145,170,170,195,2,2,2,2,"Ø   160","Ø",180,2,2,null,null,2,2,2,null,"75   175",75,175,95,195,2,2,2,2,105,205,2,2,2,2,2,2,2,2,2,2,2,2,2,2,2,2,null,null,null,null,null,null,null,null,null,null,null,75175,75,175,"pvc EP 25"]
[60,0.51,4.4119999999999999,5.1499999999999997E-2,0.59699999999999998,2.4133639999999996,1.89449074,3.4634200000000002,null,0.54699999999999993,90,0,45,null,null,null,"selecteer hoger    ","selecteer hoger"," ","selecteer hoger"," ",{"$f":"taal!$A$62","v":"selecteer hoger"}," ",100,230,{"$f":"taal!$A$62","v":"selecteer hoger"},null,{"$f":"taal!$A$62","v":"selecteer hoger"},null,{"$f":"taal!$A$62","v":"selecteer hoger"},null,{"$f":"taal!$A$62","v":"selecteer hoger"},null,90,120,{"$f":"IF(OR(kleur=3,kleur=4),taal!$A$62,\"Ø\")","v":"Ø"},{"$f":"IF(OR(kleur=3,kleur=4),\"*\",170)","v":170},{"$f":"taal!$A$62","v":"selecteer hoger"}," ",100,150,{"$f":"taal!$A$62","v":"selecteer hoger"},null,{"$f":"taal!$A$62","v":"selecteer hoger"},null,"160   200",160,200,185,225,2,2,2,2,"Ø   170","Ø",190,null,null,null,null,null,null,2,null,"75   225",75,225,95,245,2,2,2,2,105,255,2,2,2,2,2,2,2,2,2,2,2,2,2,2,2,2,null,null,null,null,null,null,null,null,null,null,null,75225,75,225,"pvc EP 25"]
[70,0.51,4.4119999999999999,5.1499999999999997E-2,0.69700000000000006,2.8545639999999999,2.2408327400000005,3.4634200000000002,null,0.64700000000000002,90,0,55,null,null,null,"   ","","",0,0,null,null,100,250,null,null,null,null,null,null,null,null,90,150,{"$f":"IF(OR(kleur=3,kleur=4),\"*\",170)","v":170},{"$f":"IF(OR(kleur=3,kleur=4),\"*\",170)","v":170}," "," ",100,160," "," ",null,null,"160   220",160,220,185,245,2,2,2,2,"Ø   180","Ø",200,2,2,null,null,2,2,2,null,"80   110",80,110,100,130,2,2,2,2,110,140,2,2,2,2,2,2,2,2,2,2,2,2,2,2,2,2,null,null,null,null,null,null,null,null,null,null,null,80110,80,110,"pvc EP 25"]
[80,0.51,4.4119999999999999,5.1499999999999997E-2,0.79699999999999993,3.2957639999999997,2.58717474,3.4634200000000002,null,0.74699999999999989,90,0,65,null,null,null,"   ","","",0,0,null,null,100,280,null,null,null,null,null,null,null,null,90,180,{"$f":"IF(OR(kleur=3,kleur=4),\"*\",\"Ø\")","v":"Ø"},{"$f":"IF(OR(kleur=3,kleur=4),\"*\",180)","v":180}," "," ",100,180," "," ",null,null,"160   250",160,250,185,275,2,2,2,2,"Ø   200","Ø",220,2,2,null,null,2,2,2,null,"80   130",80,130,100,150,2,2,2,2,110,160,2,2,2,2,2,2,2,2,2,2,2,2,2,2,2,2,null,null,null,null,null,null,null,null,null,null,null,80130,80,130,"pvc EP 25"]
[90,0.51,4.4119999999999999,5.1499999999999997E-2,0.89700000000000002,3.736964,2.9335167400000004,3.4634200000000002,null,0.84699999999999998,90,0,75,null,null,null,"   ",{"$f":"IF(glas=6,AR68,IF(glas=5,AP68,IF(glas>2,AN68,IF(glas>1,AL68,IF(T68=0,\"\",T68)))))","v":""},{"$f":"IF(glas=6,AS68,IF(glas=5,AQ68,IF(glas>2,AO68,IF(glas>1,AM68,IF(U68=0,\"\",U68)))))","v":""},{"$f":"IF(OR(type=1,type=2),AF68,IF(type=3,AJ68,IF(type=4,AH68,IF(AND(bol=1,vorm=3)=TRUE,Z68,IF(AND(bol=1,vorm=1)=TRUE,V68,IF(AND(bol=1,vorm=2)=TRUE,X68,IF(AND(bol=2,vorm=1)=TRUE,AB68,IF(AND(bol=2,vorm=2)=TRUE,AD68,\"\"))))))))","v":0},{"$f":"IF(OR(type=1,type=2),AG68,IF(type=3,AK68,IF(type=4,AI68,IF(AND(bol=1,vorm=3)=TRUE,AA68,IF(AND(bol=1,vorm=1)=TRUE,W68,IF(AND(bol=1,vorm=2)=TRUE,Y68,IF(AND(bol=2,vorm=1)=TRUE,AC68,IF(AND(bol=2,vorm=2)=TRUE,AE68,\"\"))))))))","v":0},null,null,100,300,null,null,null,null,null,null,null,null,90,210,{"$f":"IF(OR(kleur=3,kleur=4),\"*\",180)","v":180},{"$f":"IF(OR(kleur=3,kleur=4),\"*\",180)","v":180}," "," ",100,200," "," ",null,null,"160   280",160,280,185,305,2,2,2,2,null,null,null,null,null,null,null,null,null,null,null,"80   140",80,140,100,160,2,2,2,2,110,170,2,2,2,2,2,2,2,2,2,2,2,2,2,2,2,2,null,null,null,null,null,null,null,null,null,null,null,80140,80,140,"pvc EP 25"]
[100,0.51,4.4119999999999999,5.1499999999999997E-2,0.99699999999999989,4.1781639999999989,3.2798587399999994,3.4634200000000002,null,0.94699999999999984,90,0,85,null,null,null,{"$f":"R69 &\"   \"&S69","v":"   "},"","",0,0,null,null,105,165,null,null,null,null,null,null,null,null,"Ø",100,{"$f":"IF(OR(kleur=3,kleur=4),\"*\",\"Ø\")","v":"Ø"},{"$f":"IF(OR(kleur=3,kleur=4),\"*\",200)","v":200}," "," ",100,220," "," ",null,null,{"$f":"AU69&\"   \"&AV69","v":"Ø   40"},"Ø",40,"Ø",{"$f":"AV69+25","v":65},2,null,null,null,null,null,null,null,null,null,null,null,null,null,null,"80   160",80,160,100,180,2,2,2,2,{"$f":"BO69+30","v":110},{"$f":"BP69+30","v":190},2,2,2,2,2,2,2,2,2,2,2,2,2,2,2,2,null,null,null,null,null,null,null,null,null,null,null,80160,80,160,"pvc EP 25"]
[null,null,null,null,null,null,null,null,null,null,null,null,null,null,null,null,"   ","","",0,0,null,null,105,225,null,null,null,null,null,null,null,null,100,100,{"$f":"IF(OR(kleur=3,kleur=4),\"*\",200)","v":200},{"$f":"IF(OR(kleur=3,kleur=4),\"*\",200)","v":200}," "," ",100,230," "," ",null,null,"Ø   50","Ø",50,"Ø",75,2,null,null,null,null,null,null,null,null,null,null,null,null,null,null,"80   170",80,170,100,190,2,2,2,2,110,200,2,2,2,2,2,2,2,2,2,2,2,2,2,2,2,2,null,null,null,null,null,null,null,null,null,null,null,80170,80,170,"pvc EP 25"]
["Verhogingsopstand pvc 20/00 EP-S",0.61,{"$f":"IF(vorm<3,((($K$19+$L$19)*2/1000)+8*$D32),($L$19+2*$D32)/1000*3.14)","v":4.47248},null,{"$f":"0.2*IF(AND(K19<>0,N1=2),(N6-1),0)","v":0},{"$f":"$C71*$E71","v":0},null,null,null,null,null,null,null,null,null,null,"   ","","",0,0,null,null,110,140,null,null,null,null,null,null,null,null,100,130,null,null," "," ",100,250," "," ",null,null,"Ø   60","Ø",60,"Ø",85,2,null,null,null,null,null,null,null,null,null,null,null,null,null,null,{"$f":"BO71&\"   \"&BP71","v":"80   180"},80,180,{"$f":"BO71+20","v":100},{"$f":"BP71+20","v":200},2,2,2,2,110,210,2,2,2,2,2,2,2,2,2,2,2,2,2,2,2,2,null,null,null,null,null,null,null,null,null,null,null,80180,80,180,"pvc EP 25"]
[null,null,null,null,null,null,null,null,null,null,null,null,null,null,null,null,"   ","","",0,0,null,null,110,170,null,null,null,null,null,null,null,null,100,150,null,null," "," ",100,280," "," ",null,null,"Ø   70","Ø",70,"Ø",95,2,null,null,null,null,null,null,null,null,null,null,null,null,null,null,"80   200",80,200,100,220,2,2,2,2,110,230,2,2,2,2,2,2,2,2,2,2,2,2,2,2,2,2,null,null,null,null,null,null,null,null,null,null,null,80200,80,200,"pvc EP 25"]
["Result curb:",{"$f":"IF(AND(op=3,vorm=3),\"?\",IF(op=1,INDEX(B32:B36,prvc),IF(op=2,INDEX('Skylux EP'!B38:B45,prvc),IF(op=3,INDEX('Skylux EP'!B47:B57,prvc),IF(op=4,INDEX('Skylux EP'!B59:B69,prvc))))))","v":0.61},"= (Uup)",null,null,{"$f":"IF(op=1,INDEX(F32:F36,G1),IF(op=2,INDEX('Skylux EP'!F38:F45,G1),IF(op=3,INDEX('Skylux EP'!F47:F57,G1),IF(op=4,INDEX('Skylux EP'!F59:F69,G1)))))","v":0.60691553599999981},{"$f":"IF(op=2,INDEX('Skylux EP'!G38:G45,G1),IF(op=3,INDEX('Skylux EP'!G47:G57,G1),IF(op=4,INDEX('Skylux EP'!G59:G69,G1),\"?\")))","v":"?"},null,null,null,null,{"$f":"IF(op=1,INDEX(L32:L36,H1),IF(op=2,INDEX('Skylux EP'!L38:L45,I1),IF(op=3,INDEX('Skylux EP'!L47:L57,J1),IF(op=4,INDEX('Skylux EP'!L59:L69,J1)))))","v":0},{"$f":"IF(op=1,INDEX(M32:M36,I1),IF(op=2,INDEX('Skylux EP'!M38:M45,J1),IF(op=3,INDEX('Skylux EP'!M47:M57,K1),IF(op=4,INDEX('Skylux EP'!M59:M69,K1)))))+E71*100","v":5},null,null,null,"   ","","",0,0,null,null,110,230,null,null,null,null,null,null,null,null,100,160,null,null," "," ",100,300," "," ",null,null,"Ø   80","Ø",80,"Ø",105,2,null,null,null,null,null,null,null,null,null,null,null,null,null,null,"80   220",80,220,100,240,2,2,2,2,110,250,2,2,2,2,2,2,2,2,2,2,2,2,2,2,2,2,null,null,null,null,null,null,null,null,null,null,null,80220,80,220,"pvc EP 25"]
["Result with raised curb :",{"$f":"IF(op=5,0,(B71*F71+B73*F73)/F74)","v":0.61},"= (Uup)",null,null,{"$f":"F73+F71","v":0.60691553599999981},null,null,null,null,null,null,null,null,null,null,"   ","","",0,0,null,null,120,140,null,null,null,null,null,null,null,null,100,180,null,null," "," ",105,105," "," ",null,null,"Ø   90","Ø",90,"Ø",115,2,null,null,null,null,null,null,null,null,null,null,null,null,null,null,"80   230",80,230,100,250,2,2,2,2,110,260,2,2,2,2,2,2,2,2,2,2,2,2,2,2,2,2,null,null,null,null,null,null,null,null,null,null,null,80230,80,230,"pvc EP 25"]
[null,{"$f":"IF(K19=0,G73,F74)","v":0.60691553599999981},"= (Aup)",null,null,null,null,null,null,null,null,null,null,null,null,null,"selecteer hoger    ","selecteer hoger"," ","selecteer hoger"," ",{"$f":"taal!$A$62","v":"selecteer hoger"}," ",120,150,{"$f":"taal!$A$62","v":"selecteer hoger"},null,{"$f":"taal!$A$62","v":"selecteer hoger"},null,{"$f":"taal!$A$62","v":"selecteer hoger"},null,{"$f":"taal!$A$62","v":"selecteer hoger"},null,100,190,{"$f":"taal!$A$62","v":"selecteer hoger"},null,{"$f":"taal!$A$62","v":"selecteer hoger"}," ",105,165,{"$f":"taal!$A$62","v":"selecteer hoger"},null,{"$f":"taal!$A$62","v":"selecteer hoger"},null,"Ø   100","Ø",100,"Ø",125,2,null,null,null,null,null,null,null,null,null,null,null,null,null,null,"80   250",80,250,100,270,2,2,2,2,110,280,2,2,2,2,2,2,2,2,2,2,2,2,2,2,2,2,null,null,null,null,null,null,null,null,null,null,null,80250,80,250,"pvc EP 25"]
[null,{"$f":"L73","v":0},"(C-B)",null,null,null,null,null,null,null,null,null,null,null,null,null,"   ","","",0,0,null,null,120,180,null,null,null,null,null,null,null,null,100,200,null,null," "," ",105,225," "," ",null,null,"Ø   110","Ø",110,"Ø",135,2,null,null,null,null,null,null,null,null,null,null,null,null,null,null,"80   280",80,280,100,300,2,2,2,2,110,310,2,2,2,2,2,2,2,2,2,2,2,2,2,2,2,2,null,null,null,null,null,null,null,null,null,null,null,80280,80,280,"pvc EP 25"]
[null,null,null,null,null,null,null,null,null,null,null,null,null,null,null,null,"   ","","",0,0,null,null,120,210,null,null,null,null,null,null,null,null,100,220,null,null," "," ",110,110," "," ",null,null,{"$f":"AU77&\"   \"&AV77","v":"Ø   120"},"Ø",120,"Ø",145,2,null,null,null,null,null,null,null,null,null,null,null,null,null,null,"90   120",90,120,110,140,2,2,2,2,120,150,2,2,2,2,2,2,2,2,2,2,2,2,2,2,2,2,null,null,null,null,null,null,null,null,null,null,null,90120,90,120,"pvc EP 25"]
["Types of frame",null,null,null,null,null,null,null,null,null,null,null,null,null,null,null,"   ","","",0,0,null,null,120,240,null,null,null,null,null,null,null,null,100,230,null,null," "," ",110,140," "," ",null,null,"Ø   130","Ø",130,"Ø",155,2,null,null,null,null,null,null,null,null,null,null,null,null,null,null,"90   150",90,150,110,170,2,2,2,2,120,180,2,2,2,2,2,2,2,2,2,2,2,2,2,2,2,2,null,null,null,null,null,null,null,null,null,null,null,90150,90,150,"pvc EP 25"]
[null,"Ue","Pe","Pe (z daglight-1side)","ee","Ae",null,null,null,null,null,null,null,null,null,null,"   ","","",0,0,null,null,130,160,null,null,null,null,null,null,null,null,100,250,null,null," "," ",110,170," "," ",null,null,"Ø   160","Ø",160,"Ø",185,2,null,null,null,null,null,null,null,null,null,null,null,null,null,null,"90   180",90,180,110,200,2,2,2,2,120,210,2,2,2,2,2,2,2,2,2,2,2,2,2,2,2,2,null,null,null,null,null,null,null,null,null,null,null,90180,90,180,"pvc EP 25"]
["pvc",1.5,{"$f":"IF(vorm<3,((($K$19+$L$19)*2/1000)+8*$D80),($L$19+2*$D80)/1000*3.14)","v":4.3540000000000001},4.4249999999999998E-2,0.1004,{"$f":"$C80*$E80","v":0.43714160000000002},null,null,null,null,null,null,null,null,null,null,"   ","","",0,0,null,null,130,190,null,null,null,null,null,null,null,null,100,280,null,null," "," ",110,230," "," ",null,null,"Ø   170","Ø",170,"Ø",195,2,null,null,null,null,null,null,null,null,null,null,null,null,null,null,"90   210",90,210,110,230,2,2,2,2,120,240,2,2,2,2,2,2,2,2,2,2,2,2,2,2,2,2,null,null,null,null,null,null,null,null,null,null,null,90210,90,210,"pvc EP 25"]
["pvc EP high",0.75,{"$f":"IF(vorm<3,((($K$19+$L$19)*2/1000)+8*$D81),($L$19+2*$D81)/1000*3.14)","v":4.3540000000000001},4.4249999999999998E-2,{"$f":"(144.43+10+46.4)/1000","v":0.20083000000000001},{"$f":"$C81*$E81","v":0.87441382000000001},null,null,null,null,null,null,null,null,null,null,"   ","","",0,0,null,null,130,200,null,null,null,null,null,null,null,null,100,300,null,null," "," ",120,120," "," ",null,null,{"$f":"AU81&\"   \"&AV81","v":"Ø   180"},"Ø",180,"Ø",205,2,null,null,null,null,null,null,null,null,null,null,null,null,null,null,"100   130",100,130,120,150,2,2,2,2,130,160,2,2,2,2,2,2,2,2,2,2,2,2,2,2,2,2,null,null,null,null,null,null,null,null,null,null,null,100130,100,130,"pvc EP 25"]
["pvc EP25 high",0.75,{"$f":"IF(vorm<3,((($K$19+$L$19)*2/1000)+8*$D82),($L$19+2*$D82)/1000*3.14)","v":4.3540000000000001},4.4249999999999998E-2,{"$f":"(144.43+10+37.25)/1000","v":0.19168000000000002},0.8345747200000001,null,null,null,null,null,null,null,null,null,null,"   ","","",0,0,null,null,130,220,null,null,null,null,null,null,null,null,105,105,null,null," "," ",120,140," "," ",null,null,"Ø   200","Ø",200,"Ø",{"$f":"AV82+25","v":225},2,null,null,null,null,null,null,null,null,null,null,null,null,null,null,"100   150",100,150,120,170,2,2,2,2,130,180,2,2,2,2,2,2,2,2,2,2,2,2,2,2,2,2,null,null,null,null,null,null,null,null,null,null,null,100150,100,150,"pvc EP 25"]
["pvc IP32 high",0.75,{"$f":"IF(vorm<3,((($K$19+$L$19)*2/1000)+8*$D83),($L$19+2*$D83)/1000*3.14)","v":4.3540000000000001},4.4249999999999998E-2,{"$f":"(144.43+10+37.25)/1000","v":0.19168000000000002},0.8345747200000001,null,null,null,null,null,null,null,null,null,null,"   ","","",0,0,null,null,130,230,null,null,null,null,null,null,null,null,105,165,null,null," "," ",120,150," "," ",null,null,"   ",null,null,null,null,null,null,null,null,null,null,null,null,null,null,null,null,null,null,null,"100   160",100,160,120,180,2,2,2,2,130,190,2,2,2,2,2,2,2,2,2,2,2,2,2,2,2,2,null,null,null,null,null,null,null,null,null,null,null,100160,100,160,"pvc EP 25"]
["pvc IP89 high",0.75,{"$f":"IF(vorm<3,((($K$19+$L$19)*2/1000)+8*$D84),($L$19+2*$D84)/1000*3.14)","v":4.3540000000000001},4.4249999999999998E-2,{"$f":"(144.43+10+37.25)/1000","v":0.19168000000000002},0.8345747200000001,null,null,null,null,null,null,null,null,null,null,"   ","","",0,0,null,null,130,250,null,null,null,null,null,null,null,null,105,225,null,null," "," ",120,180," "," ",null,null,"   ",null,null,null,null,null,null,null,null,null,null,null,null,null,null,null,null,null,null,null,{"$f":"BO84&\"   \"&BP84","v":"100   180"},100,180,{"$f":"BO84+20","v":120},{"$f":"BP84+20","v":200},2,2,2,2,{"$f":"BO84+30","v":130},{"$f":"BP84+30","v":210},2,2,2,2,2,2,2,2,2,2,2,2,2,2,2,2,null,null,null,null,null,null,null,null,null,null,null,100190,100,190,"pvc EP 25"]
[{"$f":"IF(glas=6,\"pvc Vitria low\",\"pvc iDome low\")","v":"pvc iDome low"},1.08,{"$f":"IF(vorm<3,((($K$19+$L$19)*2/1000)+8*$D85),($L$19+2*$D85)/1000*3.14)","v":4.3540000000000001},4.4249999999999998E-2,9.5250000000000001E-2,0.41471849999999999,null,null,null,null,null,null,null,null,null,null,"selecteer hoger    ","selecteer hoger"," ","selecteer hoger"," ",{"$f":"taal!$A$62","v":"selecteer hoger"}," ",130,280,{"$f":"taal!$A$62","v":"selecteer hoger"},null,{"$f":"taal!$A$62","v":"selecteer hoger"},null,{"$f":"taal!$A$62","v":"selecteer hoger"},null,{"$f":"taal!$A$62","v":"selecteer hoger"},null,"Ø",110,{"$f":"taal!$A$62","v":"selecteer hoger"},null,{"$f":"taal!$A$62","v":"selecteer hoger"}," ",120,210,{"$f":"taal!$A$62","v":"selecteer hoger"},null,{"$f":"taal!$A$62","v":"selecteer hoger"},null,"   ",null,null,null,null,null,null,null,null,null,null,null,null,null,null,null,null,null,null,null,"100   190",100,190,120,210,2,2,2,2,130,220,2,2,2,2,2,2,2,2,2,2,2,2,2,2,2,2,null,null,null,null,null,null,null,null,null,null,null,100200,100,200,"pvc EP 25"]
["pvc iDome high",0.49,4.24,0.03,{"$f":"(144.43+8+20)/1000","v":0.17243},0.73110320000000006,null,null,null,null,null,null,null,null,null,null,"   ","","",0,0,null,null,145,170,null,null,null,null,null,null,null,null,110,110,null,null," "," ",130,130," "," ",null,null,"   ",null,null,null,null,null,null,null,null,null,null,null,null,null,null,null,null,null,null,null,"100   200",100,200,120,220,2,2,2,2,130,230,2,2,2,2,2,2,2,2,2,2,2,2,2,2,2,2,null,null,null,null,null,null,null,null,null,null,null,100220,100,220,"pvc EP 25"]
["pvc iWindow2 low",1.08,4.3540000000000001,4.4249999999999998E-2,9.2350000000000002E-2,{"$f":"$C87*$E87","v":0.4020919},null,null,null,null,null,null,null,null,null,null,"   ","","",0,0,null,null,160,200,null,null,null,null,null,null,null,null,110,140,null,null," "," ",130,160," "," ",null,null,"   ",null,null,null,null,null,null,null,null,null,null,null,null,null,null,null,null,null,null,null,"100   220",100,220,120,240,2,2,2,2,130,250,2,2,2,2,2,2,2,2,2,2,2,2,2,2,2,2,null,null,null,null,null,null,null,null,null,null,null,100230,100,230,"pvc EP 25"]
["pvc iWindow2 high",0.49,4.24,0.03,{"$f":"(154.01+16.5)/1000","v":0.17050999999999999},0.72296240000000001,null,null,null,null,null,null,null,null,null,null,"   ","","",0,0,null,null,160,220,null,null,null,null,null,null,null,null,110,170,null,null,null,null,140,140,null,null,null,null,"   ",null,null,null,null,null,null,null,null,null,null,null,null,null,null,null,null,null,null,null,"100   230",100,230,120,250,2,2,2,2,130,260,2,2,2,2,2,2,2,2,2,2,2,2,2,2,2,2,null,null,null,null,null,null,null,null,null,null,null,100250,100,250,"pvc EP 25"]
["pvc iWindow3 low",1.08,4.3540000000000001,4.4249999999999998E-2,9.1950000000000004E-2,{"$f":"$C89*$E89","v":0.40035030000000005},null,null,null,null,null,null,null,null,null,null,{"$f":"R89 &\"   \"&S89","v":"   "},"","",0,0,null,null,160,230,null,null,null,null,null,null,null,null,110,230,null,null,null,null,150,150,null,null,null,null,"   ",null,null,null,null,null,null,null,null,null,null,null,null,null,null,null,null,null,null,null,"100   250",100,250,120,270,2,2,2,2,130,280,2,2,2,2,2,2,2,2,2,2,2,2,2,2,2,2,null,null,null,null,null,null,null,null,null,null,null,100280,100,280,"pvc EP 25"]
["pvc iWindow3 high",0.49,4.3540000000000001,4.4249999999999998E-2,{"$f":"(176.7+0)/1000","v":0.1767},0.76935180000000003,null,null,null,null,null,null,null,null,null,null,"   ","","",0,0,null,null,160,250,null,null,null,null,null,null,null,null,"Ø",120,null,null,null,null,null,null,null,null,null,null,"   ",null,null,null,null,null,null,null,null,null,null,null,null,null,null,null,null,null,null,null,"100   280",100,280,120,300,2,2,2,2,130,310,2,2,2,2,2,2,2,2,2,2,2,2,2,2,2,2,null,null,null,null,null,null,null,null,null,null,null,{"$f":"(DA90&DB90)*1","v":105165},105,165,"pvc EP 25"]
["Polyester",0.32,4.3540000000000001,4.4249999999999998E-2,8.5800000000000001E-2,{"$f":"$C91*$E91","v":0.37357319999999999},"(GRP = round)",null,null,null,null,null,null,null,null,null,"   ","","",0,0,null,null,160,280,null,null,null,null,null,null,null,null,120,120,null,null,null,null,{"$f":"taal!$A$62","v":"selecteer hoger"},null,null,null,null,null,"   ",null,null,null,null,null,null,null,null,null,null,null,null,null,null,null,null,null,null,null,{"$f":"BO91&\"   \"&BP91","v":"100   300"},100,300,{"$f":"BO91+20","v":120},{"$f":"BP91+20","v":320},null,null,null,null,null,null,null,null,null,null,2,null,null,null,2,2,null,null,null,null,null,null,null,null,null,null,null,null,null,null,null,null,null,{"$f":"(DA91&DB91)*1","v":105225},105,225,"pvc EP 25"]
[null,null,null,null,null,null,null,null,null,null,null,null,null,null,null,null,"   ","","",0,0,null,null,null,null,null,null,null,null,null,null,null,null,120,140,null,null,null,null,null,null,null,null,null,null,"   ",null,null,null,null,null,null,null,null,null,null,null,null,null,null,null,null,null,null,null,{"$f":"BO92&\"   \"&BP92","v":"105   165"},105,165,{"$f":"BO92+20","v":125},{"$f":"BP92+20","v":185},2,2,2,2,{"$f":"BO92+30","v":135},{"$f":"BP92+30","v":195},2,2,2,2,2,2,2,2,2,2,2,2,2,2,2,2,null,null,null,null,null,null,null,null,null,null,null,{"$f":"(DA92&DB92)*1","v":110140},110,140,"pvc EP 25"]
[null,null,null,null,null,null,null,null,null,null,null,null,null,null,null,null,"   ","","",0,0,null,null,null,null,null,null,null,null,null,null,null,null,120,150,null,null,null,null,null,null,null,null,null,null,"   ",null,null,null,null,null,null,null,null,null,null,null,null,null,null,null,null,null,null,null,"105   225",105,225,125,245,2,2,2,2,135,255,2,2,2,2,2,2,2,2,2,2,2,2,2,2,2,2,null,null,null,null,null,null,null,null,null,null,null,{"$f":"(DA93&DB93)*1","v":110170},110,170,"pvc EP 25"]
["Aluminium",9,{"$f":"IF(vorm<3,((($K$19+$L$19)*2/1000)+8*$D94),($L$19+2*$D94)/1000*3.14)","v":4.3540000000000001},4.4249999999999998E-2,7.2819999999999996E-2,{"$f":"$C94*$E94","v":0.31705827999999997},null,null,null,null,null,null,null,null,null,null,"   ","","",0,0,null,null,null,null,null,null,null,null,null,null,null,null,120,180,{"$f":"taal!$A$62","v":"selecteer hoger"},null,null,null,null,null,null,null,null,null,"   ",null,null,null,null,null,null,null,null,null,null,null,null,null,null,null,null,null,null,null,"110   140",110,140,130,160,2,2,2,2,140,170,2,2,2,2,2,2,2,2,2,2,2,2,2,2,2,2,null,null,null,null,null,null,null,null,null,null,null,{"$f":"(DA94&DB94)*1","v":110230},110,230,"pvc EP 25"]
["Result edge profile",{"$f":"INDEX(B80:B91,raam-1)","v":{"$error":"#VALUE!"}},"= (Ue)",null,null,{"$f":"INDEX(F80:F91,raam-1)","v":{"$error":"#VALUE!"}},"= (Ae)",null,null,null,null,null,null,null,null,null,"   ","","",0,0,null,null,null,null,null,null,null,null,null,null,null,null,120,210,null,null,null,null,null,null,null,null,null,null,"   ",null,null,null,null,null,null,null,null,null,null,null,null,null,null,null,null,null,null,null,"110   170",110,170,130,190,2,2,2,2,140,200,2,2,2,2,2,2,2,2,2,2,2,2,2,2,2,2,null,null,null,null,null,null,null,null,null,null,null,{"$f":"(DA95&DB95)*1","v":120140},120,140,"pvc EP 25"]
[null,null,null,null,null,null,null,null,null,null,null,null,null,null,null,null,"   ","","",0,0,null,null,null,null,null,null,null,null,null,null,null,null,120,240,null,null,null,null,null,null,null,null,null,null,"   ",null,null,null,null,null,null,null,null,null,null,null,null,null,null,null,null,null,null,null,"110   230",110,230,130,250,2,2,2,2,140,260,2,2,2,2,2,2,2,2,2,2,2,2,2,2,2,2,null,null,null,null,null,null,null,null,null,null,null,120150,120,150,"pvc EP 25"]
["Adapter frame",null,null,null,null,null,null,null,null,null,null,null,null,null,null,null,"   ","","",0,0,null,null,null,null,null,null,null,null,null,null,null,null,"Ø",130,null,null,null,null,null,null,null,null,null,null,"   ",null,null,null,null,null,null,null,null,null,null,null,null,null,null,null,null,null,null,null,"120   140",120,140,140,160,2,2,2,2,150,170,2,2,2,2,2,2,2,2,2,2,2,2,2,2,2,2,null,null,null,null,null,null,null,null,null,null,null,120180,120,180,"pvc EP 25"]
[null,"Ue","Pe","Pe (z daglight-1side)","ee","Ae",null,null,null,null,null,null,null,null,null,null,"   ","","",0,0,null,null,null,null,null,null,null,null,null,null,null,null,130,130,null,null,null,null,{"$f":"taal!$A$62","v":"selecteer hoger"},null,null,null,null,null,"   ",null,null,null,null,null,null,null,null,null,null,null,null,null,null,null,null,null,null,null,"120   150",120,150,140,170,2,2,2,2,150,180,2,2,2,2,2,2,2,2,2,2,2,2,2,2,2,2,null,null,null,null,null,null,null,null,null,null,null,120210,120,210,"pvc EP 25"]
["pvc adapterframe",0.82,{"$f":"IF(vorm<3,((($K$19+$L$19)*2/1000)+8*$D99),($L$19+2*$D99)/1000*3.14)","v":4.3600000000000003},4.4999999999999998E-2,{"$f":"IF(raam=1,0.101,0.056)","v":0.10100000000000001},{"$f":"$C99*$E99","v":0.44036000000000008},null,null,null,null,null,null,null,null,null,null,"   ","","",0,0,null,null,null,null,null,null,null,null,null,null,null,null,130,160,null,null,null,null,null,null,null,null,null,null,"   ",null,null,null,null,null,null,null,null,null,null,null,null,null,null,null,null,null,null,null,"120   180",120,180,140,200,2,2,2,2,150,210,2,2,2,2,2,2,2,2,2,2,2,2,2,2,2,2,null,null,null,null,null,null,null,null,null,null,null,120240,120,240,"pvc EP 25"]
[null,null,null,null,null,null,null,null,null,null,null,null,null,null,null,null,"   ",{"$f":"IF(glas=6,AR100,IF(glas=5,AP100,IF(glas>2,AN100,IF(glas>1,AL100,IF(T100=0,\"\",T100)))))","v":""},{"$f":"IF(glas=6,AS100,IF(glas=5,AQ100,IF(glas>2,AO100,IF(glas>1,AM100,IF(U100=0,\"\",U100)))))","v":""},{"$f":"IF(OR(type=1,type=2),AF100,IF(type=3,AJ100,IF(type=4,AH100,IF(AND(bol=1,vorm=3)=TRUE,Z100,IF(AND(bol=1,vorm=1)=TRUE,V100,IF(AND(bol=1,vorm=2)=TRUE,X100,IF(AND(bol=2,vorm=1)=TRUE,AB100,IF(AND(bol=2,vorm=2)=TRUE,AD100,\"\"))))))))","v":0},{"$f":"IF(OR(type=1,type=2),AG100,IF(type=3,AK100,IF(type=4,AI100,IF(AND(bol=1,vorm=3)=TRUE,AA100,IF(AND(bol=1,vorm=1)=TRUE,W100,IF(AND(bol=1,vorm=2)=TRUE,Y100,IF(AND(bol=2,vorm=1)=TRUE,AC100,IF(AND(bol=2,vorm=2)=TRUE,AE100,\"\"))))))))","v":0},null,null,null,null,null,null,null,null,null,null,null,null,130,190,null,null,null,null,null,null,null,null,null,null,"   ",null,null,null,null,null,null,null,null,null,null,null,null,null,null,null,null,null,null,null,"120   210",120,210,140,230,2,2,2,2,150,240,2,2,2,2,2,2,2,2,2,2,2,2,2,2,2,2,null,null,null,null,null,null,null,null,null,null,null,130160,130,160,"pvc EP 25"]
[null,null,null,null,null,null,null,null,null,null,null,null,null,null,null,null,"   ","","",0,0,null,null,null,null,null,null,null,null,null,null,null,null,130,200,null,null,null,null,null,null,null,null,null,null,"   ",null,null,null,null,null,null,null,null,null,null,null,null,null,null,null,null,null,null,null,"120   240",120,240,140,260,2,2,2,2,150,270,2,2,2,2,2,2,2,2,2,2,2,2,2,2,2,2,null,null,null,null,null,null,null,null,null,null,null,130190,130,190,"pvc EP 25"]
[null,null,null,null,null,null,null,null,null,null,null,null,null,null,null,null,"   ","","",0,0,null,null,null,null,null,null,null,null,null,null,null,null,130,220,null,null,null,null,null,null,null,null,null,null,"   ",null,null,null,null,null,null,null,null,null,null,null,null,null,null,null,null,null,null,null,"130   160",130,160,150,180,2,2,2,2,160,190,2,2,2,2,2,2,2,2,2,2,2,2,2,2,2,2,null,null,null,null,null,null,null,null,null,null,null,130200,130,200,"pvc EP 25"]
[null,null,null,null,null,null,null,null,null,null,null,null,null,null,null,null,"   ","","",0,0,null,null,null,null,null,null,null,null,null,null,null,null,130,230,null,null,null,null,null,null,null,null,null,null,"   ",null,null,null,null,null,null,null,null,null,null,null,null,null,null,null,null,null,null,null,"130   190",130,190,150,210,2,2,2,2,160,220,2,2,2,2,2,2,2,2,2,2,2,2,2,2,2,2,null,null,null,null,null,null,null,null,null,null,null,130220,130,220,"pvc EP 25"]
[null,null,null,null,null,null,null,null,null,null,null,null,null,null,null,null,"   ","","",0,0,null,null,null,null,null,null,null,null,null,null,null,null,130,250,null,null,null,null,null,null,null,null,null,null,"   ",null,null,null,null,null,null,null,null,null,null,null,null,null,null,null,null,null,null,null,"130   200",130,200,150,220,2,2,2,2,160,230,2,2,2,2,2,2,2,2,2,2,2,2,2,2,2,2,null,null,null,null,null,null,null,null,null,null,null,130230,130,230,"pvc EP 25"]
[null,null,null,null,null,null,null,null,null,null,null,null,null,null,null,null,"   ","","",0,0,null,null,null,null,null,null,null,null,null,null,null,null,130,280,null,null,null,null,null,null,null,null,null,null,"   ",null,null,null,null,null,null,null,null,null,null,null,null,null,null,null,null,null,null,null,"130   220",130,220,150,240,2,2,2,2,160,250,2,2,2,2,2,2,2,2,2,2,2,2,2,2,2,2,null,null,null,null,null,null,null,null,null,null,null,130250,130,250,"pvc EP 25"]
[null,null,null,null,null,null,null,null,null,null,null,null,null,null,null,null,"   ","","",0,0,null,null,null,null,null,null,null,null,null,null,null,null,"Ø",140,null,null,null,null,null,null,null,null,null,null,"   ",null,null,null,null,null,null,null,null,null,null,null,null,null,null,null,null,null,null,null,"130   230",130,230,150,250,2,2,2,2,160,260,2,2,2,2,2,2,2,2,2,2,2,2,2,2,2,2,null,null,null,null,null,null,null,null,null,null,null,130280,130,280,"pvc EP 25"]
[null,null,null,null,null,null,null,null,null,null,null,null,null,null,null,null,"   ","","",0,0,null,null,null,null,null,null,null,null,null,null,null,null,140,140,null,null,null,null,null,null,null,null,null,null,"   ",null,null,null,null,null,null,null,null,null,null,null,null,null,null,null,null,null,null,null,"130   250",130,250,150,270,2,2,2,2,160,280,2,2,2,2,2,2,2,2,2,2,2,2,2,2,2,2,null,null,null,null,null,null,null,null,null,null,null,145170,145,170,"pvc EP 25"]
[null,null,null,null,null,null,null,null,null,null,null,null,null,null,null,null,"   ","","",{"$f":"IF(OR(type=1,type=2),AF108,IF(type=3,AJ108,IF(type=4,AH108,IF(AND(bol=1,vorm=3)=TRUE,Z108,IF(AND(bol=1,vorm=1)=TRUE,V108,IF(AND(bol=1,vorm=2)=TRUE,X108,IF(AND(bol=2,vorm=1)=TRUE,AB108,IF(AND(bol=2,vorm=2)=TRUE,AD108,\"\"))))))))","v":0},0,null,null,null,null,null,null,null,null,null,null,null,null,145,170,null,null,null,null,null,null,null,null,null,null,"   ",null,null,null,null,null,null,null,null,null,null,null,null,null,null,null,null,null,null,null,"130   280",130,280,150,300,2,2,2,2,160,310,2,2,2,2,2,2,2,2,2,2,2,2,2,2,2,2,null,null,null,null,null,null,null,null,null,null,null,160200,160,200,"pvc EP 25"]
[null,null,null,null,null,null,null,null,null,null,null,null,null,null,null,null,"   ","","",0,0,null,null,null,null,null,null,null,null,null,null,null,null,150,150,null,null,null,null,null,null,null,null,null,null,"   ",null,null,null,null,null,null,null,null,null,null,null,null,null,null,null,null,null,null,null,"145   170",145,170,165,190,2,2,2,2,175,200,2,2,2,2,2,2,2,2,2,2,2,2,2,2,2,2,null,null,null,null,null,null,null,null,null,null,null,160220,160,220,"pvc EP 25"]
[null,null,null,null,null,null,null,null,null,null,null,null,null,null,null,null,"   ","","",0,0,null,null,null,null,null,null,null,null,null,null,null,null,155,155,null,null,null,null,null,null,null,null,null,null,"   ",null,null,null,null,null,null,null,null,null,null,null,null,null,null,null,null,null,null,null,"160   200",160,200,180,220,2,2,2,2,190,230,2,2,2,2,2,2,2,2,2,2,2,2,2,2,2,2,null,null,null,null,null,null,null,null,null,null,null,160230,160,230,"pvc EP 25"]
[null,null,null,null,null,null,null,null,null,null,null,null,null,null,null,null,"   ","","",0,0,null,null,null,null,null,null,null,null,null,null,null,null,"Ø",160,null,null,null,null,null,null,null,null,null,null,"   ",null,null,null,null,null,null,null,null,null,null,null,null,null,null,null,null,null,null,null,"160   220",160,220,180,240,2,2,2,2,190,250,2,2,2,2,2,2,2,2,2,2,2,2,2,2,2,2,null,null,null,null,null,null,null,null,null,null,null,160250,160,250,"pvc EP 25"]
["g-values",null,null,null,null,null,null,null,null,null,null,null,null,null,null,null,"   ","","",0,0,null,null,null,null,null,null,null,null,null,null,null,null,160,160,null,null,null,null,null,null,null,null,null,null,"   ",null,null,null,null,null,null,null,null,null,null,null,null,null,null,null,null,null,null,null,"160   230",160,230,180,250,2,2,2,2,190,260,2,2,2,2,2,2,2,2,2,2,2,2,2,2,2,2,null,null,null,null,null,null,null,null,null,null,null,160280,160,280,"pvc EP 25"]
[null,"EP10","EP16","5W","4W","3W","2W","1W","Skylux iDome","TOPX 25","iWindow 2","iWindow3","Vitira",null,null,null,"   ","","",0,0,null,null,null,null,null,null,null,null,null,null,null,null,160,200,null,null,null,null,null,null,null,null,null,null,"   ",null,null,null,null,null,null,null,null,null,null,null,null,null,null,null,null,null,null,null,"160   250",160,250,180,270,2,2,2,2,190,280,2,2,2,2,2,2,2,2,2,2,2,2,2,2,2,2]
["clear",null,null,0.47,0.54,0.65,0.75,0.87,0.53,0.66,{"$f":"IF(kleur=2,0.5,IF(kleur=3,0.4,0.52))","v":0.52},{"$f":"IF(kleur=2,0.41,IF(kleur=3,0.33,0.42))","v":0.42},0.59,null,null,null,"   ","","",0,0,null,null,null,null,null,null,null,null,null,null,null,null,160,220,null,null,null,null,null,null,null,null,null,null,"   ",null,null,null,null,null,null,null,null,null,null,null,null,null,null,null,null,null,null,null,"160   280",160,280,180,300,2,2,2,2,190,310,2,2,2,2,2,2,2,2,2,2,2,2,2,2,2,2]
["opal PMMA",0.43,null,0.41,0.48,0.51,0.57999999999999996,0.76,null,null,null,null,null,null,null,null,"   ","","",0,0,null,null,null,null,null,null,null,null,null,null,null,null,160,230,null,null,null,null,null,null,null,null,null,null,"   "]
["clear PC ",null,null,0.47,0.52,0.63,0.72,0.83,null,null,null,null,null,null,null,null,"   ","","",0,0,null,null,null,null,null,null,null,null,null,null,null,null,{"$f":"IF(kleur>2,160,\"\")","v":""},{"$f":"IF(kleur>2,250,\"\")","v":""},null,null,null,null,null,null,null,null,null,null,"   "]
["opal PC",0.41,0.32,0.41,0.46,0.48,0.63,0.6,null,null,null,null,null,null,null,null,{"$f":"R117 &\"   \"&S117","v":"   "},"","",0,0,null,null,null,null,null,null,null,null,null,null,null,null,{"$f":"IF(kleur>2,160,\"\")","v":""},{"$f":"IF(kleur>2,280,\"\")","v":""},null,null,null,null,null,null,null,null,null,null,"   "]
["heatstop PC",null,null,null,0.32,0.39,0.45,0.59,null,null,null,null,null,null,null,null,"   ","","",0,0,null,null,null,null,null,null,null,null,null,null,null,null,"Ø",170,null,null,null,null,null,null,null,null,null,null,"   "]
["g-values",{"$f":"INDEX(B114:B118,kleur)","v":0},0,0.47,0.54,0.65,0.75,0.87,null,null,null,null,null,null,null,null,"   ","","",0,0,null,null,null,null,null,null,null,null,null,null,null,null,170,170,null,null,null,null,null,null,null,null,null,null,{"$f":"AU119&\"   \"&AV119","v":"   "}]
[null,null,null,null,null,null,null,null,null,null,null,null,{"$f":"IF(glas=2,\"-\",IF(glas=1,IF(raam=4,J114*INDEX(B119:H119,type),INDEX(B119:H119,type)),IF(glas=3,I114*INDEX(B119:H119,type),IF(glas=4,K114,IF(glas=5,L114,IF(glas=6,M114,\"Kies type\"))))))","v":0.65},null,null,null,{"$f":"R120 &\"   \"&S120","v":"   "},"","",0,0,null,null,null,null,null,null,null,null,null,null,null,null,"Ø",180,null,null,null,null,null,null,null,null,null,null,"   "]
[null,null,null,null,null,null,null,null,null,null,null,null,null,null,null,null,"   ","","",0,0,null,null,null,null,null,null,null,null,null,null,null,null,180,180,null,null,null,null,null,null,null,null,null,null,{"$f":"AU121&\"   \"&AV121","v":"   "}]
["surface outer sheet dome",{"$f":"IF(glas<4,IF(OR(vorm=3,AND(OR(type=4,type=3),K19=0)),C127,INDEX(B124:B125,bol)),IF(glas=4,(K19+75)*(L19+75)/1000000,IF(glas=6,(K19+20)*(L19+20)/1000000,(K19+28)*(L19+28)/1000000)))","v":1.1244441034190922},"= At",null,null,"zone of transition",{"$f":"IF(raam=2,G125,IF(OR(raam=3,AND(raam=4,vorm<3),raam=5,raam=6),G127,IF(raam=13,G126,IF(OR(raam=7,raam=8),G129,IF(OR(raam=9,raam=10),G130,IF(OR(raam=11,raam=12),G131,G124))))))","v":4},"= lt",{"$f":"IF(raam=2,I125,IF(OR(raam=3,AND(raam=4,vorm<3),raam=5,raam=6),I127,IF(raam=13,I126,IF(OR(raam=7,raam=8),I129,IF(OR(raam=9,raam=10),I130,IF(OR(raam=11,raam=12),I131,I124))))))","v":3.7999999999999999E-2},"= ψt",null,null,null,null,null,null,{"$f":"R122 &\"   \"&S122","v":"   "},"","",0,0,null,null,null,null,null,null,null,null,null,null,null,null,"Ø",200]
[null,null,null,null,null,"transparent part",null,null,null,null,null,null,null,null,null,null,{"$f":"R123 &\"   \"&S123","v":"   "},"","",0,0,null,null,null,null,null,null,null,null,null,null,null,null,200,200]
["round",{"$f":"A131*LARGE(K19:L19,1)/1000000","v":1.1244441034190922},"(outer sheet)",null,null,"Skylux",{"$f":"IF(vorm<3,((($K$19+$L$19)*2/1000)+8*$H124),($L$19+2*$H124)/1000*3.14)","v":4},0,{"$f":"J124","v":3.7999999999999999E-2},3.7999999999999999E-2,"PE mousse",null,null,null,null,null,"   ","","",0,0]
["pyramidal",{"$f":"A135","v":1.1547005383792515},"(outer sheet)",null,null,"Skylux + pvc",3.9655999999999998,-4.3E-3,{"$f":"J125","v":3.7999999999999999E-2},3.7999999999999999E-2,"PE mousse"]
["sphere",null,"round",null,null,"Skylux + prv",4.1672000000000002,2.0899999999999998E-2,3.7999999999999999E-2,3.7999999999999999E-2,"PE mousse"]
[{"$f":"SMALL(K19:L19,1)","v":1000},"chord",{"$f":"($L$19*$L$19/1000000+4*$A$128/1000*$A$128/1000)*PI()/4","v":0.93745124783119427},null,null,"Skylux + EP",3.6320000000000001,-4.5999999999999999E-2,7.6999999999999999E-2,7.6999999999999999E-2,"IFT Rosenheim Alu spacer"]
[{"$f":"pijlbol*10","v":220},"rise of arc",null,null,null,"Skylux + Aluminium",4.1348799999999999,1.686E-2,3.7999999999999999E-2,3.7999999999999999E-2,"PE mousse"]
[{"$f":"($A$127/2)/(SIN($A$130*PI()/180/2))","v":678.18181818181813},"radius",null,null,null,"iDome",4.16,0.02,4.1000000000000002E-2,4.1000000000000002E-2,"IFT Rosenheim"]
[{"$f":"4*ATAN($A$128/($A$127/2))*180/PI()","v":94.997977971467066},"alfa °",null,null,null,"iWindow2",4.2240000000000002,2.8000000000000001E-2,4.1000000000000002E-2,4.1000000000000002E-2,"IFT Rosenheim"]
[{"$f":"A130/360*2*PI()*A129","v":1124.4441034190922},"arc length",null,null,null,"iWindow3",4.5999999999999996,7.4999999999999997E-2,3.7999999999999999E-2,3.7999999999999999E-2,"IFT Rosenheim"]
["piramide:"]
[30,{"$f":"SMALL(K19:L19,1)","v":1000},{"$f":"LARGE(K19:L19,1)","v":1000},{"$f":"(C133-B133)","v":0},null,"zone of transition",{"$f":"G135","v":0},"= le",{"$f":"I135","v":0},"= ψe"]
[{"$f":"B133/2","v":500},{"$f":"A134/COS(A133*PI()/180)","v":577.35026918962569},{"$f":"2*B133*B134/1000000","v":1.1547005383792515},{"$f":"D133*B134*2/1000000","v":0},null,"edge profile 1"]
[{"$f":"SUM(C134+D134)","v":1.1547005383792515},"= surface of pyramidal outer wall",null,null,null,null,0,"= le",0,"= ψe"]
[]
[null,null,null,null,null,"zone of transition",{"$f":"G139","v":4.3600000000000003},"= le",{"$f":"I139","v":4.1000000000000002E-2},"= ψe"]
[null,null,null,null,null,"edge profile 2"]
[null,null,null,null,null,null,{"$f":"IF(vorm<3,((($K$19+$L$19)*2/1000)+8*$D$99),($L$19+2*D99)/1000*3.14)","v":4.3600000000000003},"= le",4.1000000000000002E-2,"= ψe"]
[]
[]
["D.4.2",{"$f":"(IF(raam=1,0,$F$95*$B$95)+IF(adap=1,0,$F$99*B99)+$B$122*invoerblad!E15+$G$122*$I$122)/(IF(raam=1,0,$F$95)+IF(adap=1,0,$F$99)+$B$122)","v":1.8351779066098652},"W/m².K",null,"Ur of individual rooflights including the edge profile",null,null,"Ur = (Ae x Ue + At x Ut + lt x ψt) / (Ae + At)"]
["D.4.3 // D.4.5",{"$f":"($B$75*$B$73+IF(raam=1,0,$F$95*$B$95)+IF(adap=1,0,$F$99*B99)+$B$122*invoerblad!E15+$G$122*$I$122+IF(raam=1,0,$G$133*$I$133)+IF(adap=1,0,$G$137*$I$137))/($B$75+IF(raam=1,0,$F$95)+IF(adap=1,0,$F$99)+$B$122)","v":1.4057006975102175},"W/m².K",null,"Ur of individual rooflights including/excluding the edge profile and including upstand",null,null,"Urc = (Aup x Uup + Ae x Ue + At x Ut + le x ψe + lt x ψt) / (Aup + Ae + At)"]
["D.4.4",{"$f":"(($B$75+IF(raam=1,0,$F$95)+IF(adap=1,0,$F$99))*$B$73+$B$122*invoerblad!E15+$G$122*$I$122)/($B$75+IF(raam=1,0,$F$95)+IF(adap=1,0,$F$99)+$B$122)","v":1.4057006975102175},"W/m².K",null,"Urc of individual rooflights including the edge profile and upstand (alternative method)",null,null,"Urc = ((Aup + Ae) x Uup,e + At x Ut + lt x ψt) / (Aup + Ae + At)"]

{"sheet":"taal","index":2,"n_rows":72,"n_cols":10,"rows_kept":72,"cut":false,"hidden":true,"merged":[]}
[null,null,"n","f","d","e","Hrvatski (croatian)","Polski","Czech","Latvian"]
[{"$f":"IF(B2=0,\"\",B2)","v":"taal"},{"$f":"INDEX(C2:J2,taal)","v":"taal"},"taal","langue","Sprache","language","jezik","język","Jazyk","Valoda"]
["bol","bol","bol","bombée","Bogenförmig","spherical shaped","zaobljena","sferyczna","Oblouk","Sfēriskas formas"]
["piramide","piramide","piramide","pyramidale","Pyramidenförmig","pyramid","piramidalna","piramidalna","Pyramida","Piramīda"]
["vierkant","vierkant","vierkant","carré","quadratisch","square","kvadratna","kwadratowa","Čtverec","Kvadrāts"]
["rechthoekig","rechthoekig","rechthoekig","rectangulaire","rechteckig","rectangular","pravokutna","prostokątna","Obdélník","Taisnstūrveida"]
["rond","rond","rond","circulaire","rund","round","okrugla","okrągła","Kruh","Apļveida"]
["vorm","vorm","vorm","forme","Form","shape","oblik","kształt -","Tvar","Forma"]
["niet mogelijk","niet mogelijk","niet mogelijk","na pas possible","nicht Möglich","not possible","nema mogućnosti","niewykonalne","Není možno","Nav iespējams"]
["pvc-opstand","pvc-opstand","pvc-opstand","costière en pvc","pvc Aufsatzkränz","pvc-curb","pvc nastavni vijenac","z pvc","pvc manžeta","PVC pamatne"]
["polyesteropstand","polyesteropstand","polyesteropstand","costière en polyester","GFK Aufsatzkränz","polyestercurb","Poliester nastavni vijenac","poliestrowa","Polyesterová manžeta","Poliestera pamatne"]
["metalen opstand","metalen opstand","metalen opstand","costière métallique","Metallaufsatzkränz","metal curb ","metalni nastavni vijenac","metalowa","Železný rám","Metāla pamatne"]
[{"$f":"IF(B13=0,\"\",B13)","v":"metalen opstand EP"},"metalen opstand EP","metalen opstand EP","costière métallique EP","Metallaufsatzkränz EP","metal curb EP","metalni nastavni vijenac EP","metalowa EP (Energy Profit)","Železný rám EP","Metāla pamatne"]
["eigen opstand","eigen opstand","eigen opstand","propre costière","eigene Aufsatzkränz","own curb","vlastiti vijenac","własna","Vlastní manžeta/rám","Esošā pamatne"]
["opstand","opstand","opstand","costière","Aufsatzkränz","curb","nastavni vijenac","podstawa","Manžeta/rám","Pamatne"]
[{"$f":"IF(B16=0,\"\",B16)","v":"verhogingsopstand"},"verhogingsopstand","verhogingsopstand","costière de rehausse","ErhöhungsaAufsatzkränz","raised curb","nastavni vijenac povećanje","podstawa zwiększenie","Manžeta/rám zvýšit","Pacelta pamatne"]
[{"$f":"IF(B17=0,\"\",B17)","v":"geen"},"geen","geen","non","keine","no","ne","nie","žádný","Nē"]
["A - maat","A - maat","A - maat","mesure A","A - Abmessung","A - size","A - nazivna mjera","A - wymiar zewnętrzny kopułki","Rozměr A","A-Izmērs"]
["B - maat","B - maat","B - maat","mesure B","B - Abmessung","B - size","B - svjetlosna mjera","B - wymiar w świetle kopułki","Rozměr B","B-Izmērs"]
["C - maat","C - maat","C - maat","mesure C","C - Abmessung","C - size","C - građ. Mjera","C - wymiar w świetle dachu","Rozměr C","C-Izmērs"]
["PVC 16/00","PVC 16/00","PVC 16/00","PVC 16/00","PVC 16/00","PVC 16/00","PVC 16/00","PVC 16/00","PVC 16/00","PVC 16/00"]
["PVC 16/20","PVC 16/20","PVC 16/20","PVC 16/20","PVC 16/20","PVC 16/20","PVC 16/20","PVC 16/20","PVC 16/20","PVC 16/20"]
["PVC 30/20","PVC 30/20","PVC 30/20","PVC 30/20","PVC 30/20","PVC 30/20","PVC 30/20","PVC 30/20","PVC 30/20","PVC 30/20"]
[{"$f":"IF(B24=0,\"\",B24)","v":"uitvoering"},"uitvoering","uitvoering","type","Ausführung","type","izvedba","typ -","Typ","Tips"]
[{"$f":"IF(B25=0,\"\",B25)","v":"EP10 koepel"},"EP10 koepel","EP10 koepel","coupole EP10","EP10 Lichtkuppel","EP10 skydome","EP10 svjetlosna kupola","EP 10 (Energy Profit)","Kopule EP10","EP10 Skydome-Kupols"]
[{"$f":"IF(B26=0,\"\",B26)","v":"EP16 koepel"},"EP16 koepel","EP16 koepel","coupole EP16","EP16 Lichtkuppel","EP16 skydome","EP16 svjetlosna kupola","EP 16 (Energy Profit)","Kopule EP16","EP16 skydome-Kupols"]
[{"$f":"IF(B27=0,\"\",B27)","v":"vijfwandig"},"vijfwandig","vijfwandig","cinq paroi","Fünfschalig","five walled","pet stijenki","5 - warstwowa","pěti-vrstvá","Piecu slāņu kupols"]
[{"$f":"IF(B28=0,\"\",B28)","v":"vierwandig"},"vierwandig","vierwandig","quatre paroi","Vierschalig","four walled","četirislojna","4 - warstwowa","čtyř-vrstvá","Četru slāņu kupols"]
["driewandig","driewandig","driewandig","triple paroi","Dreischalig","triple walled","troslojna","3 - warstwowa","tří-vrstvá","Trīs slāņu kupols"]
["dubbelwandig","dubbelwandig","dubbelwandig","double paroi","Doppelchalig","double walled","dvoslojna","2 - warstwowa","dvoj-vrstvá","Divu slāņu kupols"]
["enkelwandig","enkelwandig","enkelwandig","simple paroi","Einschalig","single walled","jednoslojna","1 - warstwowa","jedno-vrstvá","Viena slāņa kupols"]
["dagmaat B","dagmaat B","dagmaat B","ouverture jour B","Tageslichtmass B","daylight size B","svjetlosna mjera B","B - wymiar w świetle kopułki","Velikost světlíku B","Dienas gaismas izmērs B"]
["dakopening C","dakopening C","dakopening C","ouverture à la base C","Dachöffnung C","roofopening C","građ. mjera C","C - wymiar w świetle dachu","Střešní otvor C","Jumta atvērums C"]
["overmeten maat A",{"$f":"INDEX(C34:J34,taal)","v":"overmeten maat A"},"overmeten maat A","mesure extérieure A","Gesamtbreite A","overall domesize A","nazivna mjera A","A - wymiar zewnętrzny kopułki","Celková velikost kopule A","Kopējais izmērs A"]
["niet verkrijgbaar","niet verkrijgbaar","niet verkrijgbaar","ne pas livrable","nicht Lieferbar","not available","nema mogućnosti","nie wykonalne","Není k dispozici","Nav pieejams"]
["lichtkoepel","lichtkoepel","lichtkoepel","coupole ","Lichtkuppel","skydome","kupola","kopułka","Kopule","Skydome-Kupols"]
["lichtkoepel + HR++ glas","lichtkoepel + HR++ glas","lichtkoepel + HR++ glas","coupole + verre HR++","Lichtkuppel + Glas HR++","skydome + glass HR++","kupola + čaša HR++","kopułka + szkło HR++","Kopule + sklo HR++","Skydome-Kupols+HR++Stikls"]
["glas HR++","glas HR++","glas HR++","verre HR++","Glas HR++","glass HR++","čaša HR++","szkło HR++","Sklo HR++","Stikls HR++"]
["oppervlakte","oppervlakte","oppervlakte","surface","Oberfläche","surface","površina","powierzchnia","Povrch","Platība"]
["t.o.v. de geprojecteerde oppte","t.o.v. de geprojecteerde oppte","t.o.v. de geprojecteerde oppte","à la surface projetée","zum projizierten Oberfläche","to the projected area","na projicirano područje","do projektowanego obszaru","do projektované oblasti","uz prognozēto zonu"]
["Ut-waarde","Ut-waarde","Ut-waarde","valeur Ut","Ut-Wert","Ut-value","Ut-vrijednost","Wartość Ut","Ut-hodnota","Ut-Vērtība"]
[{"$f":"IF(B42=0,\"\",B42)","v":"Ug-waarde"},"Ug-waarde","Ug-waarde","valeur Ug","Ug-Wert","Ug-value","Ug-vrijednost","Wartość Ug","Ug-hodnota","Ug-Vērtība"]
[{"$f":"IF(B43=0,\"\",B43)","v":"Ue-waarde"},"Ue-waarde","Ue-waarde","valeur Ue","Ue-Wert","Ue-value","Ue-vrijednost","Wartość Ue","Ue hodnota","Ue-Vērtība"]
[{"$f":"IF(B44=0,\"\",B44)","v":"Urc-waarde "},"Urc-waarde ","Urc-waarde ","valeur Urc","Urc-Wert","Urc-value","Urc-vrijednost","Wartość Urc","Urc-hodnota","Urc-Vērtība"]
[{"$f":"IF(B45=0,\"\",B45)","v":"Url-waarde"},"Url-waarde","Url-waarde","valeur Url","Url-Wert","Url-value","Url-vrijednost","Wartość Url","Url hodnota","Url-Vērtība"]
["g-waarde ","g-waarde ","g-waarde ","valeur g","g-Wert","g-value","g-vrijednost","Wartość g","g-hodnota","g-Vērtība"]
["opstand","opstand","opstand","costière","Aufsatzkränz","curb","nastavni vijenac","podstawa","Manžeta/rám","Pamatne"]
["helder","helder","helder","clair","klar","clear","kristal","przezroczysta","Čirá","Caurspīdīgs"]
["opaal","opaal","opaal","opalin","opal","opal","opal","mleczna","Opál","Matēta virsma"]
["heatstop","heatstop","heatstop","heatstop","heatstop","heatstop","heatstop","heatstop","Úprava proti prohřívání","Karstumu bloķējošais slānis"]
[{"$f":"IF(B51=0,\"\",B51)","v":"verduisterend"},{"$f":"INDEX(C51:J51,taal)","v":"verduisterend"},"verduisterend","occultant","verdunkelung","blackout","zasjeniti","zaciemnienie","výpadek proudu","aptumšošana"]
[{"$f":"IF(B52=0,\"\",B52)","v":"zonwerend glas"},{"$f":"INDEX(C52:J52,taal)","v":"zonwerend glas"},"zonwerend glas","vitrage à contrôle solaire","wärmereflektierendes Glas ","heat reflective glass","staklo koje reflektira toplinu","szkło odbijające ciepło","sklo odrážející teplo","siltumu atstarojošs stikls"]
[{"$f":"IF(B53=0,\"\",B53)","v":"PMMA"},"PMMA","PMMA","PMMA","PMMA","PMMA","akril","akrylowa","Akryl (PMMA)","Akrila loksne"]
["PC","PC","PC","PC","PC","PC","polikarbonat","poliwęglanowa","Polykarbonát (PC)","Polikarbonāta loksne"]
["kleur","kleur","kleur","couleur","Farbe","colour","boja","kolor -","Barva","Krāsa"]
["kleurkeuze?","kleurkeuze?","kleurkeuze?","choix de couleur ?","Farbewahl ?","Choose the colour","izaberi boju","wybór koloru","Zvolte barvu","Izvēlēties krāsu"]
["lichtkoepel","lichtkoepel","lichtkoepel","coupole","Lichtkuppel","skydome","kupola","kopułka","Kopule","Kupols"]
[{"$f":"IF(B58=0,\"\",B58)","v":"Pergotop IP32/IP89"},{"$f":"INDEX(C58:J58,taal)","v":"Pergotop IP32/IP89"},"Pergotop IP32/IP89","Pergotop IP32/IP89","Pergotop IP32/IP89","Pergotop IP32/IP89","Pergotop IP32/IP89","Pergotop IP32/IP89","Pergotop IP32/IP89","Pergotop IP32/IP89"]
[{"$f":"IF(B59=0,\"\",B59)","v":"opstand"},{"$f":"INDEX(C59:J59,taal)","v":"opstand"},"opstand","costière","Aufsatzkränz","curb","vijenac","podstawa","manžeta/rám","Pamatne"]
["NIET geïsoleerd","NIET geïsoleerd","NIET geïsoleerd","NON isolé","NICHT isoliert","NOT insulated","nije izolirano","nieizolowane","Neizolované "," Siltumizolācija"]
["kleur kiezen","kleur kiezen","kleur kiezen","choisissez la couleur","wählen Sie die Farbe","select your colour ","odaberi boju","wybierz kolor","Vyberte barvu","Atlasiet savu krāsu"]
["selecteer hoger","selecteer hoger","selecteer hoger","faites votre choix plus haut","wählen Sie obenan","make your choice above","odaberi","wybierz","Vyberte vyšší","Izvēlietes no augstāk minētajiem"]
["raam","raam","raam","châssis","Rahmen","frame","okvir","rama","Rám","Rāmis"]
[{"$f":"IF(B64=0,\"\",B64)","v":"adapterraam"},{"$f":"INDEX(C64:J64,taal)","v":"adapterraam"},"adapterraam","châssis d'adaptation","Adapterrahmen","adapter frame","okvir adaptera","rama adaptera","rám adaptéru","adaptera rāmis"]
[{"$f":"IF(B65=0,\"\",B65)","v":"U-waarde bepaling van Skylux lichtkoepels volgens norm EN 1873:2014+A1:2016"},"U-waarde bepaling van Skylux lichtkoepels volgens norm EN 1873:2014+A1:2016","U-waarde bepaling van Skylux lichtkoepels volgens norm EN 1873:2014+A1:2016","Détermination de la valeur U des coupoles Skylux selon le norme EN 1873:2014+A1:2016","U-Wert Berechnung von Skylux Lichtkuppeln nach die Norme EN 1873:2014+A1:2016","U-value calculation of Skylux skylights according to the norm EN 1873:2014+A1:2016","U-vrijednost Skylux proizvoda prema normama EN 1873:2014+A1:2016","U - obliczenie wartości izolacyjności świetlików SKYLUX zgodnie z normą EN 1873:2014+A1:2016","Výpočet hodnoty-U světlíků Skylux je v souladu s normami EN 1873:2014+A1:2016","Skylux virsgaismas U vērtības aprēķins saskaņā ar normu EN 1873: 2014 + A1: 2016"]
["Skylux heeft het grootste gamma CE gekeurde lichtkoepels voor elk project.","Skylux heeft het grootste gamma CE gekeurde lichtkoepels voor elk project.","Skylux heeft het grootste gamma CE gekeurde lichtkoepels voor elk project.","Skylux vous offre le plus grand assortiment en coupoles avec certification CE pour chaque projet.","Skylux hat das weiteste Sortiment an CE geprüften Lichtkuppeln für jedes Projekt.","Skylux has the largest range of CE approved skylights for every project.","Skylux ima najveći izbor proizvoda sa CE certifikatom za svaki projekt","SKYLUX ma najwięcej wariantów świetlików certyfikowanych CE do zastosowania w każdym projekcie.","Skylux má nejširší sortiment CE testovaných světlíků pro každý projekt","Skylux ir lielākais CE apstiprināto virsgaismas klāsts katram projektam."]
["type","type","type","type","Typ","type","tip","typ","Typ","Tips"]
["op aanvraag","op aanvraag","op aanvraag","sur demande","auf Anfrage","on request","na zahtjev","na zamówienie","Na vyžádání","Pēc pieprasījuma"]
["maak andere keuze!","maak andere keuze!","maak andere keuze!","faire un autre choix!","andere Wahl!","make another selection!",null,"dokonaj innego wyboru!","Provést jný výběr","Veikt vēl vienu atlasi"]
["Uup-waarde","Uup-waarde","Uup-waarde","valeur Uup","Uup-Wert","Uup-value","Uup-vrijednost","Wartość Uup","Uup-hodnota","Uup-Vērtība"]
[{"$f":"IF(B71=0,\"\",B71)","v":"dikte dakisolatie"},"dikte dakisolatie","dikte dakisolatie","épaisseur d'isolation de toiture","Stärke Dachdämmung","thickness roof insulation ","krov izolacija","izolacja dachu","izolace střech","Jumta siltumizolācijas biezums"]
[{"$f":"IF(B72=0,\"\",B72)","v":"Controleer uw ingave !"},{"$f":"INDEX(C72:J72,taal)","v":"Controleer uw ingave !"},"Controleer uw ingave !","Contrölez les paramètres !","Daten überprüfen !","Check the input !","Provjerite ulaz!","Sprawdź dane wejściowe !","Zkontrolujte zadání!","Pārbaudiet ievadi!"]