{"text_format":"1","workbook":"xlsx","n_sheets":3,"sheets":["invoerblad","Skylux EP","taal"],"not_rendered":{"charts":0,"images":125,"macros":1,"external_links":0,"defined_names":18,"comments":1,"pivot_tables":0},"unopened":[],"bounds":{"document_bytes":16777216,"sheet_cells":100000,"rows_first":2000,"rows_last":500,"rows_between":2000,"halvings":0,"cell_chars":16384,"cell_head_chars":4096},"cells_cut":0,"cells_raw":0,"read":"whole","date_system":"1900"}

{"sheet":"invoerblad","index":0,"n_rows":150,"n_cols":10,"rows_kept":150,"cut":false,"hidden":false,"merged":[[18,4,18,5],[20,4,20,5]]}
[{"$f":"\"        \"&taal!A65","v":"        U-waarde bepaling van Skylux lichtkoepels volgens norm EN 1873:2014+A1:2016"},null,null,null,null,null,"v.9-2024",{"$f":"NOW()","v":"2024-09-04T14:31:42.390"},null,false]
[null,null,{"$f":"taal!A2&\" :\"","v":"taal :"},null,null,null,null,null,null,1]
[null,null,{"$f":"taal!A67&\" :\"","v":"type :"},null,null,null,null,null,null,1]
[null,null,{"$f":"taal!A24&\" \"&taal!A36&\" :\"","v":"uitvoering lichtkoepel :"},null,null,null,null,null,null,1]
[null,null,{"$f":"IF(type=1,\"\",taal!A8&\" \"&taal!A36&\" :\")","v":"vorm lichtkoepel :"},null,null,null,null,null,null,1]
[null,null,{"$f":"taal!A55&\" \"&taal!A36&\" :\"","v":"kleur lichtkoepel :"},null,null,{"$f":"IF(OR(glas>2,type>2,AND(glas=2,type=1)),\"*\",IF(OR(kleur=1,kleur=3,kleur=5)=TRUE,taal!A56,\"*\"))","v":"*"},null,null,null,1]
[null,null,{"$f":"taal!A32&\" :\"","v":"dagmaat B :"},null,null,null,null,null,null,1]
[null,null,{"$f":"taal!A15&\" :\"","v":"opstand :"},null,null,{"$f":"'Skylux EP'!M73","v":5},null,{"$f":"IF(AND(OR(op=4,op=3),metaal>6),taal!A68,\"\")&IF(AND(OR(op=3,op=4),vorm=3),taal!$A$60,IF(AND(op=1,'Skylux EP'!R2='Skylux EP'!D5)=TRUE,taal!$A$35,IF(op=1,IF(AND(pvc=1,'Skylux EP'!$CC$1=0),taal!$A$35,IF(AND(pvc=2,'Skylux EP'!$CG$1=0),taal!$A$35,IF(AND(pvc=3,'Skylux EP'!$CK$1=0),taal!$A$35,IF(AND(pvc=4,'Skylux EP'!$BS$1=0),taal!$A$35,IF(AND(pvc=5,'Skylux EP'!$BY$1=0),taal!$A$35,\"*\"))))),IF(AND(op=2,prv=1,'Skylux EP'!$AT$1=0),taal!$A$35,IF(AND(op=2,prv>1,'Skylux EP'!$BC$1=0),taal!$A$35,\"*\")))))","v":"*"},null,1]
[null,null,{"$f":"taal!A16&\" :\"","v":"verhogingsopstand :"},null,null,{"$f":"'Skylux EP'!M73","v":5},null,null,null,1]
[null,null,{"$f":"taal!A63&\" :\"","v":"raam :"},null,null,null,null,{"$f":"IF(AND(OR(raam=2,raam=3),'Skylux EP'!R2='Skylux EP'!D5)=TRUE,taal!$A$35,\"*\")","v":"*"},null,1]
[null,null,{"$f":"taal!A64&\" :\"","v":"adapterraam :"},0,null,null,null,{"$f":"IF('Skylux EP'!R2='Skylux EP'!D5,taal!$A$35,\"*\")","v":"*"},null,1]
[null,null,{"$f":"taal!A71&\" :\"","v":"dikte dakisolatie :"},5,"cm",{"$f":"IF('Skylux EP'!O17=0,taal!A72,\"\")","v":""},null,null,null,1]
[null,null,null,null,null,null,null,null,null,1]
[null,null,null,{"$f":"taal!B39&\":\"","v":"oppervlakte:"},{"$f":"IF(glas>3,taal!A42,taal!A41&\":\")","v":"Ut-waarde:"},{"$f":"taal!A70&\":\"","v":"Uup-waarde:"},{"$f":"taal!A43&\":\"","v":"Ue-waarde:"},null,null,1]
[null,null,{"$f":"IF(AND(glas=1,type<8),taal!A36,IF(AND(glas=2,type=8),taal!A38,IF(AND(glas=2,type<8),taal!A37,INDEX('Skylux EP'!B2:B7,glas))))","v":"lichtkoepel"},{"$f":"'Skylux EP'!B122","v":1.1244441034190922},{"$f":"IF(glas=1,IF(AND(raam=4,vorm<>3,'Skylux EP'!K19>0),'Skylux EP'!D28,'Skylux EP'!B28),IF(glas=2,'Skylux EP'!C28,INDEX('Skylux EP'!C28:H28,glas)))","v":1.7},"-","-",null,null,1]
{"$rows_left_out":136}
{"sheet":"Skylux EP","index":1,"n_rows":144,"n_cols":107,"rows_kept":144,"cut":false,"hidden":false,"merged":[[1,29,1,30],[0,27,0,30],[143,4,143,6],[0,85,0,87],[0,89,0,91],[142,4,142,6],[141,4,141,6],[0,71,0,73],[0,77,0,79],[0,81,0,83],[0,35,0,36],[0,33,0,34],[0,21,0,26],[1,21,1,22],[1,23,1,24],[1,25,1,26],[1,27,1,28]]}
[1,1,5,1,1,1,1,{"$f":"prvc","v":1},{"$f":"prvc","v":1},{"$f":"prvc","v":1},{"$f":"prvc","v":1},1,1,1,{"$f":"glas","v":1},1,null,12,null,"List dimensions",null,"standard dome",null,null,null,null,null,"pyramidal dome",null,null,null,"EP10  / EP 16",null,"4 Walled ",null,"5 Walled ",null,"Skylux Pergotop",null,"iDome / iWindow2",null,"iWindow3",null,"Vitria",null,{"$f":"IF(AND(op=2,AT2>1,prv=1),1,0)","v":0},{"$f":"IF(AND(op=1,pvc=1)=TRUE,20,IF(OR(op=3,AND(op=1,pvc=2))=TRUE,0,IF(AND(op=1,pvc=3)=TRUE,20,IF(AND(op=1,pvc=4)=TRUE,30,IF(AND(op=2,prv=1)=TRUE,25,20)))))","v":20},{"$f":"IF(AND(op=1,pvc=1)=TRUE,20,IF(OR(op=3,AND(op=1,pvc=2))=TRUE,0,IF(AND(op=1,pvc=3)=TRUE,20,IF(AND(op=1,pvc=4)=TRUE,30,IF(AND(op=2,prv=1)=TRUE,25,20)))))","v":20},"Standard GRP Curbs",null,null,null,null,null,{"$f":"IF(AND(op=2,BF2>1,prv=2)=TRUE,1,IF(AND(op=2,BG2>1,prv=3)=TRUE,1,IF(AND(op=2,BH2>1,prv=4)=TRUE,1,IF(AND(op=2,BI2>1,prv=5)=TRUE,1,IF(AND(op=2,BJ2>1,prv=6)=TRUE,1,IF(AND(op=2,BK2>1,prv=7)=TRUE,1,IF(AND(op=2,BL2>1,prv=8)=TRUE,1,0)))))))","v":0},"GRP Curbs",null,"15/20",3020,"D30 EP60","D30 EP100","D50/20","D30/00","D50/00",{"$f":"prv","v":1},null,null,"PVC Curbs",null,null,{"$f":"IF(AND(op=1,BS2>1,pvc=4),1,0)","v":0},"pvc 30/20",null,null,null,null,{"$f":"IF(AND(op=1,BY2>1,pvc=5),1,0)","v":0},"pvc 35/30",null,null,{"$f":"IF(AND(op=1,CC2>1,pvc=1),1,0)","v":1},"pvc 20/00EP",null,null,{"$f":"IF(AND(op=1,CG2>1,pvc=2),1,0)","v":0},"pvc 16/20EP",null,null,{"$f":"IF(AND(op=1,CK2>1,pvc=3),1,0)","v":0},"pvc 16/00",null,null,null,null,"Skin","skinheight",null,null,{"$f":"$CU$2","v":22},null,null,null,null,"EP25 frame"]
["Nederlands",{"$f":"\"Skylux\"&\" \"&taal!A57","v":"Skylux lichtkoepel"},{"$f":"IF(glas>3,\"*\",taal!A25)","v":"EP10 koepel"},{"$f":"IF(glas>3,\"*\",taal!A3)","v":"bol"},{"$f":"IF(OR(type=1,type=2,type=3,type=4,glas>1),\"*\",taal!A5)","v":"vierkant"},{"$f":"IF(K19=0,taal!A69,taal!A10)","v":"pvc-opstand"},{"$f":"IF(op=1,H2,IF(op=2,I2,IF(op=3,J2,K2)))","v":"pvc 20/00 EP"},{"$f":"IF(K19=0,taal!A69,\"pvc 20/00 EP\")","v":"pvc 20/00 EP"},{"$f":"IF(F3=\"*\",\"*\",\"PO 15/25\")","v":"PO 15/25"},{"$f":"IF(F4=\"*\",\"*\",\"M15\")","v":"M15"},{"$f":"IF(F5=\"*\",\"*\",\"M15 EP\")","v":"M15 EP"},{"$f":"IF(glas=2,taal!A51,IF(glas>3,taal!A48,IF(OR(type=1,type=2),taal!A61,taal!A48&\" \"&taal!A53)))","v":"helder PMMA"},{"$f":"IF(glas>=2,taal!A69,taal!A17)","v":"geen"},{"$f":"taal!A17","v":"geen"},{"$f":"taal!A57","v":"lichtkoepel"},{"$f":"taal!A17","v":"geen"},{"$f":"R2 &\"   \"&S2","v":"100   100"},{"$f":"INDEX(R4:R150,R1)","v":100},{"$f":"INDEX(S4:S150,R1)","v":100},null,null,"square",null,"rectangular",null,"round",null,"square",null,"rectangular",null,null,null,null,null,null,null,null,null,null,null,null,null,null,null,{"$f":"IF(ISNA(VLOOKUP($Q$2,$AT$4:$AY$129,6,FALSE))=TRUE,0,VLOOKUP($Q$2,$AT$4:$AY$129,6,FALSE))","v":2},null,null,null,null,"H15/25",null,null,null,null,null,null,{"$f":"IF(ISNA(VLOOKUP($Q$2,$BC$4:$BJ$123,4,FALSE))=TRUE,0,VLOOKUP($Q$2,$BC$4:$BJ$123,4,FALSE))","v":2},{"$f":"IF(ISNA(VLOOKUP($Q$2,$BC$4:$BJ$123,5,FALSE))=TRUE,0,VLOOKUP($Q$2,$BC$4:$BJ$123,5,FALSE))","v":2},{"$f":"IF(ISNA(VLOOKUP($Q$2,$BC$4:$BJ$123,6,FALSE))=TRUE,0,VLOOKUP($Q$2,$BC$4:$BJ$123,6,FALSE))","v":2},{"$f":"IF(ISNA(VLOOKUP($Q$2,$BC$4:$BJ$123,7,FALSE))=TRUE,0,VLOOKUP($Q$2,$BC$4:$BJ$123,7,FALSE))","v":2},{"$f":"IF(ISNA(VLOOKUP($Q$2,$BC$4:$BJ$123,8,FALSE))=TRUE,0,VLOOKUP($Q$2,$BC$4:$BJ$123,8,FALSE))","v":2},{"$f":"IF(ISNA(VLOOKUP($Q$2,$BC$4:$BK$123,9,FALSE))=TRUE,0,VLOOKUP($Q$2,$BC$4:$BK$123,9,FALSE))","v":2},{"$f":"IF(ISNA(VLOOKUP($Q$2,$BC$4:$BL$123,10,FALSE))=TRUE,0,VLOOKUP($Q$2,$BC$4:$BL$123,10,FALSE))","v":2},null,null,null,null,null,null,{"$f":"IF(ISNA(VLOOKUP($Q$2,$BN$4:$BS$122,6,FALSE))=TRUE,0,VLOOKUP($Q$2,$BN$4:$BS$122,6,FALSE))","v":2},null,null,null,null,null,{"$f":"IF(ISNA(VLOOKUP($Q$2,$BN$4:$BY$122,12,FALSE))=TRUE,0,VLOOKUP($Q$2,$BN$4:$BY$122,12,FALSE))","v":2},null,null,null,{"$f":"IF(ISNA(VLOOKUP($Q$2,$BN$4:$CC$122,16,FALSE))=TRUE,0,VLOOKUP($Q$2,$BN$4:$CC$122,16,FALSE))","v":2},null,null,null,{"$f":"IF(ISNA(VLOOKUP($Q$2,$BN$4:$CG$122,20,FALSE))=TRUE,0,VLOOKUP($Q$2,$BN$4:$CG$122,20,FALSE))","v":2},null,null,null,{"$f":"IF(ISNA(VLOOKUP($Q$2,$BN$4:$CK$122,24,FALSE))=TRUE,0,VLOOKUP($Q$2,$BN$4:$CK$122,24,FALSE))","v":2},null,null,null,null,null,null,"OS","IS1","IS2",{"$f":"IF(OR(AND(OR(type=4,type=3),K19=0),vorm=3),CU44,IF(vorm=1,CU3,IF(vorm=2,CU27,\"VORM\")))","v":22},{"$f":"IF(OR(vorm=3,AND(type=3,K19=0)),CV44,IF(vorm=1,CV3,IF(vorm=2,CV27,\"VORM\")))","v":15},{"$f":"IF(OR(vorm=3,AND(type=3,K19=0)),CW44,IF(vorm=1,CW3,IF(vorm=2,CW27,\"VORM\")))","v":12},null,null,{"$f":"R2&S2","v":"100100"}]
["Français",{"$f":"\"Skylux\"&\" \"&taal!A58","v":"Skylux Pergotop IP32/IP89"},{"$f":"IF(glas>3,\"*\",taal!A69)","v":"maak andere keuze!"},{"$f":"IF(OR(glas>3,type=1,type=2,type=3,type=4),\"*\",taal!A4)","v":"piramide"},{"$f":"IF(OR(type=1,type=2,type=3,type=4,glas>1),\"*\",taal!A6)","v":"rechthoekig"},{"$f":"taal!A11","v":"polyesteropstand"},{"$f":"IF(op=1,H3,IF(op=2,I3,IF(op=3,J3,K3)))","v":"pvc 16/20 EP"},{"$f":"IF(K19=0,taal!A69,\"pvc 16/20 EP\")","v":"pvc 16/20 EP"},{"$f":"IF(F3=\"*\",\"*\",\"PO 15/20\")","v":"PO 15/20"},{"$f":"IF(F4=\"*\",\"*\",\"M20\")","v":"M20"},{"$f":"IF(F5=\"*\",\"*\",\"M20 EP\")","v":"M20 EP"},{"$f":"IF(OR(glas=2,glas=6),taal!A69,IF(glas>3,taal!A49,IF(type=2,taal!A61,taal!A49&\" \"&taal!A53)))","v":"opaal PMMA"},{"$f":"IF(K19=0,taal!A69,IF(glas=1,A80,taal!A69))","v":"pvc"},{"$f":"IF(K19=0,taal!A17,\"pvc 20/00 EP-S\")","v":"pvc 20/00 EP-S"},"*",{"$f":"IF(K19=0,taal!A17,taal!A64)","v":"adapterraam"},null,null,null,null,null,null,null,null,null,null,null,null,null,null,null,null,null,null,null,null,null,null,null,null,null,null,null,null,null,null,null,null,null,null,"fix","st frame","EP frame","EP25 frame",null,null,null,null,null,null,null,null,null,null,null,null,"DAGMAAT",null,"DAKOPENING","C = B + 20",3020,"st","ep","ep25","DAKOPENING","C = B + 30",3530,"st","ep","ep25","2000EP","st"," ep","ep25","1620EP","st","ep","ep25",1600,"st"," ep","ep25",null,"Square",300,12.5,9,5,{"$f":"VLOOKUP(K19,CQ3:CT25,2)","v":22},{"$f":"VLOOKUP(K19,CQ3:CT25,3)","v":15},{"$f":"VLOOKUP(K19,CQ3:CT25,4)","v":12},null,null,{"$f":"CZ2*1","v":100100},{"$f":"IF(ISNA(VLOOKUP(CZ3,CZ5:DD113,4,FALSE))=TRUE,taal!A69,VLOOKUP(CZ3,CZ5:DD113,4,FALSE)&\" \"&taal!A49)","v":"pvc EP 25 opaal"}]
["Deutsch","Skylux iDome",{"$f":"IF(glas>3,\"*\",taal!A27)","v":"vijfwandig"},null,{"$f":"IF(OR(type=1,type=2,type=3,type=4,glas>1),taal!A69,IF(D1=2,taal!A9,taal!A7))","v":"rond"},{"$f":"taal!A12","v":"metalen opstand"},{"$f":"IF(op=1,H4,IF(op=2,I4,IF(op=3,J4,K4)))","v":"pvc 16/00"},{"$f":"IF(K19=0,taal!A69,IF(glas>=2,taal!A69,\"pvc 16/00\"))","v":"pvc 16/00"},{"$f":"IF(F3=\"*\",\"*\",\"PO 30/20\")","v":"PO 30/20"},{"$f":"IF(F4=\"*\",\"*\",\"M25\")","v":"M25"},{"$f":"IF(F5=\"*\",\"*\",\"M25 EP\")","v":"M25 EP"},{"$f":"IF(OR(glas=2,glas=6),taal!A69,IF(glas>3,taal!A52,IF(OR(type=1,type=2),taal!A61,taal!A48&\" \"&taal!A54)))","v":"helder PC"},{"$f":"IF(K19=0,taal!A69,IF(glas=1,A81,taal!A69))","v":"pvc EP high"},null,"iDome",null,{"$f":"R4 &\"   \"&S4","v":"30   30"},{"$f":"IF(glas=6,AR4,IF(glas=5,AP4,IF(glas>2,AN4,IF(glas>1,AL4,IF(T4=0,\"\",T4)))))","v":30},{"$f":"IF(glas=6,AS4,IF(glas=5,AQ4,IF(glas>2,AO4,IF(glas>1,AM4,IF(U4=0,\"\",U4)))))","v":30},{"$f":"IF(OR(type=1,type=2),AF4,IF(type=3,AJ4,IF(type=4,AH4,IF(AND(bol=1,vorm=3)=TRUE,Z4,IF(AND(bol=1,vorm=1)=TRUE,V4,IF(AND(bol=1,vorm=2)=TRUE,X4,IF(AND(bol=2,vorm=1)=TRUE,AB4,IF(AND(bol=2,vorm=2)=TRUE,AD4,\"\"))))))))","v":30},{"$f":"IF(OR(type=1,type=2),AG4,IF(type=3,AK4,IF(type=4,AI4,IF(AND(bol=1,vorm=3)=TRUE,AA4,IF(AND(bol=1,vorm=1)=TRUE,W4,IF(AND(bol=1,vorm=2)=TRUE,Y4,IF(AND(bol=2,vorm=1)=TRUE,AC4,IF(AND(bol=2,vorm=2)=TRUE,AE4,\"\"))))))))","v":30},30,30,30,80,"Ø",40,40,40,40,70,{"$f":"IF(type=2,\"*\",40)","v":40},{"$f":"IF(type=2,\"*\",40)","v":40},30,80,{"$f":"IF(OR(kleur=3,kleur=4),\"*\",\"Ø\")","v":"Ø"},{"$f":"IF(OR(kleur=3,kleur=4),\"*\",40)","v":40},60,60,40,40,40,40,40,40,{"$f":"AU4&\"   \"&AV4","v":"30   30"},30,30,{"$f":"AU4+25","v":55},{"$f":"AV4+25","v":55},2,2,null,null,{"$f":"BD4-20&\"   \"&BE4-20","v":"30   30"},50,50,2,0,null,null,0,null,null,null,{"$f":"BO4&\"   \"&BP4","v":"30   30"},30,30,{"$f":"BO4+20","v":50},{"$f":"BP4+20","v":50},null,null,null,null,{"$f":"BO4+30","v":60},{"$f":"BP4+30","v":60},null,null,null,null,null,null,null,null,null,null,null,null,2,2,2,2,null,null,400,15,9,5]
["English","Skylux iWindow2",{"$f":"IF(glas>3,\"*\",taal!A28)","v":"vierwandig"},"Ø",null,{"$f":"taal!A13","v":"metalen opstand EP"},{"$f":"IF(op=1,H5,IF(op=2,I5,IF(op=3,J5,K5)))","v":"pvc 30/20"},{"$f":"IF(K19=0,taal!A69,\"pvc 30/20\")","v":"pvc 30/20"},{"$f":"IF(F3=\"*\",\"*\",\"PO 30/20 EP60\")","v":"PO 30/20 EP60"},{"$f":"IF(F4=\"*\",\"*\",\"M30\")","v":"M30"},{"$f":"IF(F5=\"*\",\"*\",\"M30 EP\")","v":"M30 EP"},{"$f":"IF(glas=2,taal!A69,IF(glas>3,taal!A69,taal!A49&\" \"&taal!A54))","v":"opaal PC"},{"$f":"IF(K19=0,taal!A69,IF(glas=1,A82,taal!A69))","v":"pvc EP25 high"},null,"iWindow2",null,{"$f":"R5 &\"   \"&S5","v":"40   40"},40,40,40,40,40,40,30,90,"Ø",50,50,50,40,100,{"$f":"IF(type=2,\"*\",50)","v":50},{"$f":"IF(type=2,\"*\",50)","v":50},30,90,40,40,60,80,40,70,40,70,40,70,{"$f":"AU5&\"   \"&AV5","v":"40   40"},40,40,{"$f":"AU5+25","v":65},{"$f":"AV5+25","v":65},2,2,2,2,{"$f":"BD5-20&\"   \"&BE5-20","v":"40   40"},60,60,2,2,2,2,2,2,2,null,{"$f":"BO5&\"   \"&BP5","v":"40   40"},40,40,{"$f":"BO5+20","v":60},{"$f":"BP5+20","v":60},2,2,2,2,70,70,null,null,null,null,2,2,2,2,2,2,2,2,2,2,2,2,null,null,450,14,10,6]
["Hrvatski","Skylux iWindow3",{"$f":"IF(glas>3,\"*\",taal!A29)","v":"driewandig"},null,null,{"$f":"taal!A14","v":"eigen opstand"},{"$f":"IF(op=1,H6,IF(op=2,I6,IF(op=3,J6,K6)))","v":"pvc 35/30"},{"$f":"IF(K19=0,taal!A69,\"pvc 35/30\")","v":"pvc 35/30"},{"$f":"IF(F3=\"*\",\"*\",\"PO 30/20 EP100\")","v":"PO 30/20 EP100"},{"$f":"IF(F4=\"*\",\"*\",\"M40\")","v":"M40"},{"$f":"IF(F5=\"*\",\"*\",\"M40 EP\")","v":"M40 EP"},{"$f":"IF(glas=2,taal!A69,IF(glas>3,taal!A69,IF(type=3,taal!A69,IF(OR(type=1,type=2),taal!A61,taal!A50&\" \"&taal!A54&IF(type<7,\" \"&taal!A49,\" \")))))","v":"heatstop PC opaal"},{"$f":"IF(K19=0,taal!A69,IF(glas=2,A83,taal!A69))","v":"maak andere keuze!"},1,"iWindow3",null,"45   45",45,45,45,45,45,45,30,130,"Ø",60,60,60,50,80,60,60,30,130,40,70,60,90,40,100,50,50,40,100,"50   50",50,50,75,75,2,2,2,2,"50   50",70,70,2,2,2,2,2,null,2,null,"45   45",45,45,65,65,2,2,2,2,75,75,null,null,null,null,null,null,null,null,2,2,2,2,2,2,2,2,null,null,500,17.5,10,6,null,null,null,null,null,{"$f":"(DA6&DB6)*1","v":4040},40,40,"pvc EP 25"]
["Polski","Vitria",{"$f":"IF(glas>3,\"*\",taal!A30)","v":"dubbelwandig"},null,null,null,{"$f":"IF(op=1,H7,IF(op=2,I7,IF(op=3,J7,K7)))","v":"maak andere keuze!"},{"$f":"taal!A69","v":"maak andere keuze!"},{"$f":"IF(F3=\"*\",\"*\",\"PO 50/20\")","v":"PO 50/20"},{"$f":"IF(F4=\"*\",\"*\",\"M50\")","v":"M50"},{"$f":"IF(F5=\"*\",\"*\",\"M50 EP\")","v":"M50 EP"},null,{"$f":"IF(K19=0,taal!A69,IF(glas=2,A84,taal!A69))","v":"maak andere keuze!"},0,null,null,"50   50",50,50,50,50,50,50,40,70,"Ø",70,70,70,50,110,70,70,"Ø",40,40,100,60,120,40,130,55,55,50,50,"55   55",55,55,80,80,2,2,2,2,"55   55",75,75,2,2,2,2,2,2,2,null,"50   50",50,50,70,70,2,2,2,2,80,80,2,2,2,2,2,2,2,2,2,2,2,2,2,2,2,2,null,null,550,17,12,8,null,null,null,null,null,{"$f":"(DA7&DB7)*1","v":4545},45,45,"pvc EP 25"]
["Czech",null,{"$f":"IF(glas>3,\"*\",taal!A31)","v":"enkelwandig"},null,null,null,"maak andere keuze!",{"$f":"taal!A69","v":"maak andere keuze!"},{"$f":"IF(F3=\"*\",\"*\",\"PO 30/00\")","v":"PO 30/00"},{"$f":"IF(F4=\"*\",\"*\",\"M60\")","v":"M60"},{"$f":"IF(F5=\"*\",\"*\",\"M60 EP\")","v":"M60 EP"},null,{"$f":"IF(glas=1,taal!A69,IF(AND(OR(glas=3,glas=6),op<5),A85,taal!A69))","v":"maak andere keuze!"},{"$f":"IF(K19=0,taal!A17,\"1 (+20 cm)\")","v":"1 (+20 cm)"},null,null,"55   55",55,55,55,55,55,55,40,100,"Ø",80,75,75,{"$f":"IF(kleur>2,\"\",60)","v":60},{"$f":"IF(kleur>2,\"\",90)","v":90},70,100,40,40,{"$f":"IF(OR(kleur=3,kleur=4),\"*\",40)","v":40},{"$f":"IF(OR(kleur=3,kleur=4),\"*\",140)","v":140},60,130,40,140,60,60,60,60,"60   60",60,60,85,85,2,2,2,2,"60   60",80,80,2,2,2,2,2,2,2,null,"55   55",55,55,75,75,2,2,2,2,85,85,2,2,2,2,null,null,null,null,2,2,2,2,2,2,2,2,null,null,600,17.5,12,8,null,null,null,null,null,5050,50,50,"pvc EP 25"]
["Latvian",null,{"$f":"taal!A69","v":"maak andere keuze!"},null,null,null,"maak andere keuze!",{"$f":"taal!A69","v":"maak andere keuze!"},{"$f":"IF(F3=\"*\",\"*\",\"PO 50/00\")","v":"PO 50/00"},{"$f":"IF(F4=\"*\",\"*\",\"M70\")","v":"M70"},{"$f":"IF(F5=\"*\",\"*\",\"M70 EP\")","v":"M70 EP"},null,{"$f":"IF(glas=1,taal!A69,IF(glas=3,A86,taal!A69))","v":"maak andere keuze!"},{"$f":"IF(K19=0,taal!A17,\"2 (+ 40 cm)\")","v":"2 (+ 40 cm)"},null,null,"60   60",60,60,60,60,60,60,40,130,"Ø",90,80,80,{"$f":"IF(kleur>2,\"\",60)","v":60},{"$f":"IF(kleur>2,\"\",120)","v":120},75,75,40,70,{"$f":"IF(OR(kleur=3,kleur=4),\"*\",\"Ø\")","v":"Ø"},{"$f":"IF(OR(kleur=3,kleur=4),\"*\",50)","v":50},{"$f":"IF(raam=5,taal!$A$69,60)","v":60},{"$f":"IF(raam=5,\"\",150)","v":150},40,160,60,90,60,80,"70   70",70,70,95,95,2,2,2,2,"70   70",90,90,2,2,2,2,2,2,2,null,"60   60",60,60,80,80,2,2,2,2,90,90,2,2,2,2,2,2,2,2,2,2,2,2,2,2,2,2,null,null,700,18.5,15,12,null,null,null,null,null,5555,55,55,"pvc EP 25"]
[null,null,null,null,null,null,"maak andere keuze!",{"$f":"taal!A69","v":"maak andere keuze!"},{"$f":"taal!A69","v":"maak andere keuze!"},{"$f":"IF(F4=\"*\",\"*\",\"M80\")","v":"M80"},{"$f":"IF(F5=\"*\",\"*\",\"M80 EP\")","v":"M80 EP"},null,{"$f":"IF(glas=1,taal!A69,IF(AND(glas=4,op<5),A87,taal!A69))","v":"maak andere keuze!"},{"$f":"IF(K19=0,taal!A17,\"3 (+ 60 cm)\")","v":"3 (+ 60 cm)"},null,null,"70   70",70,70,70,70,70,70,40,140,"Ø",100,90,90,70,100,80,80,40,100,50,50,{"$f":"IF(raam=5,taal!$A$69,60)","v":60},{"$f":"IF(raam=5,\"\",180)","v":180},40,190,70,70,60,90,"75   75",75,75,100,100,2,2,2,2,"80   80",100,100,2,2,2,2,2,2,2,null,"70   70",70,70,90,90,2,2,2,2,100,100,2,2,2,2,2,2,2,2,2,2,2,2,2,2,2,2,null,null,750,17.5,14,10,null,null,null,null,null,6060,60,60,"pvc EP 25"]
[null,null,null,null,null,null,"maak andere keuze!",{"$f":"taal!A69","v":"maak andere keuze!"},{"$f":"taal!A69","v":"maak andere keuze!"},{"$f":"IF(F4=\"*\",\"*\",\"M90\")","v":"M90"},{"$f":"IF(F5=\"*\",\"*\",\"M90 EP\")","v":"M90 EP"},null,{"$f":"IF(glas=1,taal!A69,IF(glas=4,A88,taal!A69))","v":"maak andere keuze!"},null,null,null,"75   75",75,75,75,75,75,75,40,160,"Ø",110,100,100,75,125,80,130,40,130,50,70,70,70,40,220,70,100,60,120,"80   80",80,80,105,105,2,2,2,2,"90   90",110,110,2,2,2,2,null,2,2,null,"75   75",75,75,95,95,2,2,2,2,105,105,2,2,2,2,2,2,2,2,2,2,2,2,2,2,2,2,null,null,800,19,14,10,null,null,null,null,null,7070,70,70,"pvc EP 25"]
[null,null,null,null,null,null,"maak andere keuze!",{"$f":"taal!A69","v":"maak andere keuze!"},{"$f":"taal!A69","v":"maak andere keuze!"},{"$f":"IF(F4=\"*\",\"*\",\"M100\")","v":"M100"},{"$f":"IF(F5=\"*\",\"*\",\"M100 EP\")","v":"M100 EP"},null,{"$f":"IF(glas=1,taal!A69,IF(AND(glas=5,op<5),A89,taal!A69))","v":"maak andere keuze!"},null,null,null,"80   80",80,80,80,80,80,80,40,190,"Ø",120,110,110,75,175,90,90,40,140,50,80,70,100,40,280,75,75,70,70,"90   90",90,90,115,115,2,2,2,2,"100   100",120,120,2,2,2,2,2,2,2,null,"80   80",80,80,100,100,2,2,2,2,110,110,2,2,2,2,2,2,2,2,2,2,2,2,2,2,2,2,null,null,850,19,14,10,null,null,null,null,null,7575,75,75,"pvc EP 25"]
[null,null,null,null,null,null,null,null,null,null,null,null,{"$f":"IF(glas=1,taal!A69,IF(glas=5,A90,taal!A69))","v":"maak andere keuze!"},null,null,null,"85   85",85,85,85,85,85,85,40,220,"Ø",130,120,120,80,110,100,100,40,160,50,110,70,130,45,105,80,80,70,100,"100   100",100,100,125,125,2,2,2,2,"105   105",125,125,2,2,2,2,2,null,null,null,"85   85",85,85,{"$f":"BO13+20","v":105},{"$f":"BP13+20","v":105},2,2,2,2,{"$f":"BO13+30","v":115},{"$f":"BP13+30","v":115},2,2,2,2,2,2,2,2,2,2,2,2,2,2,2,2,null,null,900,19,14,10,null,null,null,null,null,8080,80,80,"pvc EP 25"]
[null,null,null,null,null,null,null,null,null,null,null,null,{"$f":"IF(AND(glas=1,K19=0),A91,taal!A69)","v":"maak andere keuze!"},null,null,null,"90   90",90,90,{"$f":"IF(OR(type=1,type=2),AF14,IF(type=3,AJ14,IF(type=4,AH14,IF(AND(bol=1,vorm=3)=TRUE,Z14,IF(AND(bol=1,vorm=1)=TRUE,V14,IF(AND(bol=1,vorm=2)=TRUE,X14,IF(AND(bol=2,vorm=1)=TRUE,AB14,IF(AND(bol=2,vorm=2)=TRUE,AD14,\"\"))))))))","v":90},90,90,90,40,280,"Ø",140,130,130,80,130,100,130,40,190,55,55,{"$f":"IF(raam=5,taal!$A$69,70)","v":70},{"$f":"IF(raam=5,\"\",150)","v":150},50,50,80,130,70,130,"105   105",105,105,130,130,2,2,2,2,"120   120",140,140,2,2,2,2,2,2,2,null,"90   90",90,90,110,110,2,2,2,2,120,120,2,2,2,2,2,2,2,2,2,2,2,2,2,2,2,2,null,null,1000,22,15,12,null,null,null,null,null,{"$f":"(DA14&DB14)*1","v":8585},85,85,"pvc EP 25"]
[null,null,null,null,null,null,null,null,null,null,null,null,null,null,null,null,"100   100",100,100,100,100,100,100,45,75,"Ø",160,140,140,80,180,100,150,45,45,{"$f":"IF(OR(kleur=3,kleur=4),\"*\",\"Ø\")","v":"Ø"},{"$f":"IF(OR(kleur=3,kleur=4),\"*\",60)","v":60},75,75,50,70,80,180,75,75,"110   110",110,110,135,135,2,2,2,2,"130   130",150,150,2,2,2,2,2,2,2,null,"100   100",100,100,120,120,2,2,2,2,130,130,2,2,2,2,2,2,2,2,2,2,2,2,2,2,2,2,null,null,1050,21,14,10,null,null,null,null,null,9090,90,90,"pvc EP 25"]
{"$rows_left_out":130}
{"sheet":"taal","index":2,"n_rows":72,"n_cols":10,"rows_kept":72,"cut":false,"hidden":true,"merged":[]}
[null,null,"n","f","d","e","Hrvatski (croatian)","Polski","Czech","Latvian"]
[{"$f":"IF(B2=0,\"\",B2)","v":"taal"},{"$f":"INDEX(C2:J2,taal)","v":"taal"},"taal","langue","Sprache","language","jezik","język","Jazyk","Valoda"]
["bol","bol","bol","bombée","Bogenförmig","spherical shaped","zaobljena","sferyczna","Oblouk","Sfēriskas formas"]
["piramide","piramide","piramide","pyramidale","Pyramidenförmig","pyramid","piramidalna","piramidalna","Pyramida","Piramīda"]
["vierkant","vierkant","vierkant","carré","quadratisch","square","kvadratna","kwadratowa","Čtverec","Kvadrāts"]
["rechthoekig","rechthoekig","rechthoekig","rectangulaire","rechteckig","rectangular","pravokutna","prostokątna","Obdélník","Taisnstūrveida"]
["rond","rond","rond","circulaire","rund","round","okrugla","okrągła","Kruh","Apļveida"]
["vorm","vorm","vorm","forme","Form","shape","oblik","kształt -","Tvar","Forma"]
["niet mogelijk","niet mogelijk","niet mogelijk","na pas possible","nicht Möglich","not possible","nema mogućnosti","niewykonalne","Není možno","Nav iespējams"]
["pvc-opstand","pvc-opstand","pvc-opstand","costière en pvc","pvc Aufsatzkränz","pvc-curb","pvc nastavni vijenac","z pvc","pvc manžeta","PVC pamatne"]
["polyesteropstand","polyesteropstand","polyesteropstand","costière en polyester","GFK Aufsatzkränz","polyestercurb","Poliester nastavni vijenac","poliestrowa","Polyesterová manžeta","Poliestera pamatne"]
["metalen opstand","metalen opstand","metalen opstand","costière métallique","Metallaufsatzkränz","metal curb ","metalni nastavni vijenac","metalowa","Železný rám","Metāla pamatne"]
[{"$f":"IF(B13=0,\"\",B13)","v":"metalen opstand EP"},"metalen opstand EP","metalen opstand EP","costière métallique EP","Metallaufsatzkränz EP","metal curb EP","metalni nastavni vijenac EP","metalowa EP (Energy Profit)","Železný rám EP","Metāla pamatne"]
["eigen opstand","eigen opstand","eigen opstand","propre costière","eigene Aufsatzkränz","own curb","vlastiti vijenac","własna","Vlastní manžeta/rám","Esošā pamatne"]
["opstand","opstand","opstand","costière","Aufsatzkränz","curb","nastavni vijenac","podstawa","Manžeta/rám","Pamatne"]
{"$rows_left_out":57}